Site: olsnba08.cern.ch
Build Name: master-x86_64-centos7-clang100-opt-cxxmodules
Build Time: 2019-11-14T00:25:06 UTC
Found 50 Errors
Warnings are here.

Build Log Line 7349
Error

          
            
0.	/.../root/interpreter/llvm/src/tools/clang/include/clang/Frontend/ASTUnit.h:27:2: current parser token 'include'
 #0 0x00007f7184e0b03a llvm::sys::PrintStackTrace(llvm::raw_ostream&) (/cvmfs/sft.cern.ch/lcg/contrib/llvm/builds/x86_64-centos7-gcc48-opt/clang_build_367044/bin/../lib/libLLVMSupport.so.10svn+0x17903a)
 #1 0x00007f7184e09069 llvm::sys::RunSignalHandlers() (/cvmfs/sft.cern.ch/lcg/contrib/llvm/builds/x86_64-centos7-gcc48-opt/clang_build_367044/bin/../lib/libLLVMSupport.so.10svn+0x177069)
 #2 0x00007f7184e091a0 SignalHandler(int) (/cvmfs/sft.cern.ch/lcg/contrib/llvm/builds/x86_64-centos7-gcc48-opt/clang_build_367044/bin/../lib/libLLVMSupport.so.10svn+0x1771a0)
 #3 0x00007f71842ea5f0 __restore_rt (/lib64/libpthread.so.0+0xf5f0)
 #4 0x00007f7184d90da4 llvm::MemoryBuffer::init(char const*, char const*, bool) (/cvmfs/sft.cern.ch/lcg/contrib/llvm/builds/x86_64-centos7-gcc48-opt/clang_build_367044/bin/../lib/libLLVMSupport.so.10svn+0xfeda4)
 #5 0x00007f7184d92fe8 llvm::MemoryBuffer::getOpenFile(int, llvm::Twine const&, unsigned long, bool, bool) (/cvmfs/sft.cern.ch/lcg/contrib/llvm/builds/x86_64-centos7-gcc48-opt/clang_build_367044/bin/../lib/libLLVMSupport.so.10svn+0x100fe8)
 #6 0x00007f7184dc83af (anonymous namespace)::RealFile::getBuffer(llvm::Twine const&, long, bool, bool) (/cvmfs/sft.cern.ch/lcg/contrib/llvm/builds/x86_64-centos7-gcc48-opt/clang_build_367044/bin/../lib/libLLVMSupport.so.10svn+0x1363af)
 #7 0x00007f7184dcb8c6 llvm::vfs::FileSystem::getBufferForFile(llvm::Twine const&, long, bool, bool) (/cvmfs/sft.cern.ch/lcg/contrib/llvm/builds/x86_64-centos7-gcc48-opt/clang_build_367044/bin/../lib/libLLVMSupport.so.10svn+0x1398c6)
 #8 0x00007f7183e5ebff clang::FileManager::getBufferForFile(clang::FileEntry const*, bool, bool) (/cvmfs/sft.cern.ch/lcg/contrib/llvm/builds/x86_64-centos7-gcc48-opt/clang_build_367044/bin/../lib/libclangBasic.so.10svn+0x2b7bff)
 #9 0x00007f71826316fb clang::serialization::ModuleManager::addModule(llvm::StringRef, clang::serialization::ModuleKind, clang::SourceLocation, clang::serialization::ModuleFile*, unsigned int, long, long, clang::ASTFileSignature, clang::ASTFileSignature (*)(llvm::StringRef), clang::serialization::ModuleFile*&, std::string&) (/cvmfs/sft.cern.ch/lcg/contrib/llvm/builds/x86_64-centos7-gcc48-opt/clang_build_367044/bin/../lib/libclangSerialization.so.10svn+0x1916fb)

Build Log Line 7380
Error
#20 0x00007f717c89f8ec clang::Parser::ParseTopLevelDecl(clang::OpaquePtr<clang::DeclGroupRef>&, bool) (/cvmfs/sft.cern.ch/lcg/contrib/llvm/builds/x86_64-centos7-gcc48-opt/clang_build_367044/bin/../lib/../lib/libclangParse.so.10svn+0xc68ec)
#21 0x00007f717c80a2dd clang::ParseAST(clang::Sema&, bool, bool) (/cvmfs/sft.cern.ch/lcg/contrib/llvm/builds/x86_64-centos7-gcc48-opt/clang_build_367044/bin/../lib/../lib/libclangParse.so.10svn+0x312dd)
#22 0x00007f7182be2099 clang::FrontendAction::Execute() (/cvmfs/sft.cern.ch/lcg/contrib/llvm/builds/x86_64-centos7-gcc48-opt/clang_build_367044/bin/../lib/libclangFrontend.so.10svn+0xee099)
#23 0x00007f7182ba96f1 clang::CompilerInstance::ExecuteAction(clang::FrontendAction&) (/cvmfs/sft.cern.ch/lcg/contrib/llvm/builds/x86_64-centos7-gcc48-opt/clang_build_367044/bin/../lib/libclangFrontend.so.10svn+0xb56f1)
#24 0x00007f7182ba9cbc void llvm::function_ref<void ()>::callback_fn<compileModuleImpl(clang::CompilerInstance&, clang::SourceLocation, llvm::StringRef, clang::FrontendInputFile, llvm::StringRef, llvm::StringRef, llvm::function_ref<void (clang::CompilerInstance&)>, llvm::function_ref<void (clang::CompilerInstance&)>)::'lambda0'()>(long) (/cvmfs/sft.cern.ch/lcg/contrib/llvm/builds/x86_64-centos7-gcc48-opt/clang_build_367044/bin/../lib/libclangFrontend.so.10svn+0xb5cbc)
#25 0x00007f7184d39297 llvm::CrashRecoveryContext::RunSafely(llvm::function_ref<void ()>) (/cvmfs/sft.cern.ch/lcg/contrib/llvm/builds/x86_64-centos7-gcc48-opt/clang_build_367044/bin/../lib/libLLVMSupport.so.10svn+0xa7297)
#26 0x00007f7184d39334 RunSafelyOnThread_Dispatch(void*) (/cvmfs/sft.cern.ch/lcg/contrib/llvm/builds/x86_64-centos7-gcc48-opt/clang_build_367044/bin/../lib/libLLVMSupport.so.10svn+0xa7334)
#27 0x00007f7184e0c13d ExecuteOnThread_Dispatch(void*) (/cvmfs/sft.cern.ch/lcg/contrib/llvm/builds/x86_64-centos7-gcc48-opt/clang_build_367044/bin/../lib/libLLVMSupport.so.10svn+0x17a13d)
#28 0x00007f71842e2e65 start_thread (/lib64/libpthread.so.0+0x7e65)
#29 0x00007f718193788d clone (/lib64/libc.so.6+0xfe88d)
clang++: error: unable to execute command: Bus error

        

Build Log Line 7381
Error

          
            
clang++: error: clang frontend command failed due to signal (use -v to see invocation)
clang version 10.0.0 (https://github.com/llvm/llvm-project.git cde00c02e11da2355ec715f571958fa180b17a43)
Target: x86_64-unknown-linux-gnu
Thread model: posix
InstalledDir: /cvmfs/sft.cern.ch/lcg/contrib/llvm/latest/x86_64-centos7-gcc48-opt/bin
clang++: note: diagnostic msg: PLEASE submit a bug report to https://bugs.llvm.org/ and include the crash backtrace, preprocessed source, and associated run script.
Stack dump:

Build Log Line 7388
Error

          
            
0.	/.../root/interpreter/llvm/src/tools/clang/include/clang/Frontend/ASTUnit.h:27:2: current parser token 'include'
 #0 0x00007f27f776e03a llvm::sys::PrintStackTrace(llvm::raw_ostream&) (/cvmfs/sft.cern.ch/lcg/contrib/llvm/builds/x86_64-centos7-gcc48-opt/clang_build_367044/bin/../lib/libLLVMSupport.so.10svn+0x17903a)
 #1 0x00007f27f776c069 llvm::sys::RunSignalHandlers() (/cvmfs/sft.cern.ch/lcg/contrib/llvm/builds/x86_64-centos7-gcc48-opt/clang_build_367044/bin/../lib/libLLVMSupport.so.10svn+0x177069)
 #2 0x00007f27f776c1a0 SignalHandler(int) (/cvmfs/sft.cern.ch/lcg/contrib/llvm/builds/x86_64-centos7-gcc48-opt/clang_build_367044/bin/../lib/libLLVMSupport.so.10svn+0x1771a0)
 #3 0x00007f27f6c4d5f0 __restore_rt (/lib64/libpthread.so.0+0xf5f0)
 #4 0x00007f27f76f3da4 llvm::MemoryBuffer::init(char const*, char const*, bool) (/cvmfs/sft.cern.ch/lcg/contrib/llvm/builds/x86_64-centos7-gcc48-opt/clang_build_367044/bin/../lib/libLLVMSupport.so.10svn+0xfeda4)
 #5 0x00007f27f76f5fe8 llvm::MemoryBuffer::getOpenFile(int, llvm::Twine const&, unsigned long, bool, bool) (/cvmfs/sft.cern.ch/lcg/contrib/llvm/builds/x86_64-centos7-gcc48-opt/clang_build_367044/bin/../lib/libLLVMSupport.so.10svn+0x100fe8)
 #6 0x00007f27f772b3af (anonymous namespace)::RealFile::getBuffer(llvm::Twine const&, long, bool, bool) (/cvmfs/sft.cern.ch/lcg/contrib/llvm/builds/x86_64-centos7-gcc48-opt/clang_build_367044/bin/../lib/libLLVMSupport.so.10svn+0x1363af)
 #7 0x00007f27f772e8c6 llvm::vfs::FileSystem::getBufferForFile(llvm::Twine const&, long, bool, bool) (/cvmfs/sft.cern.ch/lcg/contrib/llvm/builds/x86_64-centos7-gcc48-opt/clang_build_367044/bin/../lib/libLLVMSupport.so.10svn+0x1398c6)
 #8 0x00007f27f67c1bff clang::FileManager::getBufferForFile(clang::FileEntry const*, bool, bool) (/cvmfs/sft.cern.ch/lcg/contrib/llvm/builds/x86_64-centos7-gcc48-opt/clang_build_367044/bin/../lib/libclangBasic.so.10svn+0x2b7bff)
 #9 0x00007f27f4f946fb clang::serialization::ModuleManager::addModule(llvm::StringRef, clang::serialization::ModuleKind, clang::SourceLocation, clang::serialization::ModuleFile*, unsigned int, long, long, clang::ASTFileSignature, clang::ASTFileSignature (*)(llvm::StringRef), clang::serialization::ModuleFile*&, std::string&) (/cvmfs/sft.cern.ch/lcg/contrib/llvm/builds/x86_64-centos7-gcc48-opt/clang_build_367044/bin/../lib/libclangSerialization.so.10svn+0x1916fb)

Build Log Line 7419
Error
#20 0x00007f27ef2028ec clang::Parser::ParseTopLevelDecl(clang::OpaquePtr<clang::DeclGroupRef>&, bool) (/cvmfs/sft.cern.ch/lcg/contrib/llvm/builds/x86_64-centos7-gcc48-opt/clang_build_367044/bin/../lib/../lib/libclangParse.so.10svn+0xc68ec)
#21 0x00007f27ef16d2dd clang::ParseAST(clang::Sema&, bool, bool) (/cvmfs/sft.cern.ch/lcg/contrib/llvm/builds/x86_64-centos7-gcc48-opt/clang_build_367044/bin/../lib/../lib/libclangParse.so.10svn+0x312dd)
#22 0x00007f27f5545099 clang::FrontendAction::Execute() (/cvmfs/sft.cern.ch/lcg/contrib/llvm/builds/x86_64-centos7-gcc48-opt/clang_build_367044/bin/../lib/libclangFrontend.so.10svn+0xee099)
#23 0x00007f27f550c6f1 clang::CompilerInstance::ExecuteAction(clang::FrontendAction&) (/cvmfs/sft.cern.ch/lcg/contrib/llvm/builds/x86_64-centos7-gcc48-opt/clang_build_367044/bin/../lib/libclangFrontend.so.10svn+0xb56f1)
#24 0x00007f27f550ccbc void llvm::function_ref<void ()>::callback_fn<compileModuleImpl(clang::CompilerInstance&, clang::SourceLocation, llvm::StringRef, clang::FrontendInputFile, llvm::StringRef, llvm::StringRef, llvm::function_ref<void (clang::CompilerInstance&)>, llvm::function_ref<void (clang::CompilerInstance&)>)::'lambda0'()>(long) (/cvmfs/sft.cern.ch/lcg/contrib/llvm/builds/x86_64-centos7-gcc48-opt/clang_build_367044/bin/../lib/libclangFrontend.so.10svn+0xb5cbc)
#25 0x00007f27f769c297 llvm::CrashRecoveryContext::RunSafely(llvm::function_ref<void ()>) (/cvmfs/sft.cern.ch/lcg/contrib/llvm/builds/x86_64-centos7-gcc48-opt/clang_build_367044/bin/../lib/libLLVMSupport.so.10svn+0xa7297)
#26 0x00007f27f769c334 RunSafelyOnThread_Dispatch(void*) (/cvmfs/sft.cern.ch/lcg/contrib/llvm/builds/x86_64-centos7-gcc48-opt/clang_build_367044/bin/../lib/libLLVMSupport.so.10svn+0xa7334)
#27 0x00007f27f776f13d ExecuteOnThread_Dispatch(void*) (/cvmfs/sft.cern.ch/lcg/contrib/llvm/builds/x86_64-centos7-gcc48-opt/clang_build_367044/bin/../lib/libLLVMSupport.so.10svn+0x17a13d)
#28 0x00007f27f6c45e65 start_thread (/lib64/libpthread.so.0+0x7e65)
#29 0x00007f27f429a88d clone (/lib64/libc.so.6+0xfe88d)
clang++: error: unable to execute command: Bus error

        

Build Log Line 7420
Error

          
            
clang++: error: clang frontend command failed due to signal (use -v to see invocation)
clang version 10.0.0 (https://github.com/llvm/llvm-project.git cde00c02e11da2355ec715f571958fa180b17a43)
Target: x86_64-unknown-linux-gnu
Thread model: posix
InstalledDir: /cvmfs/sft.cern.ch/lcg/contrib/llvm/latest/x86_64-centos7-gcc48-opt/bin
clang++: note: diagnostic msg: PLEASE submit a bug report to https://bugs.llvm.org/ and include the crash backtrace, preprocessed source, and associated run script.
2 warnings generated.

Build Log Line 7432
Error

          
            
clang++: /mnt/build/jenkins/workspace/root-install-latest-clang-build/LABEL/ROOT-centos7-gcc62/SPEC/default/clang_build_367044/src/llvm/lib/Support/MemoryBuffer.cpp:48: void llvm::MemoryBuffer::init(const char*, const char*, bool): Assertion `(!RequiresNullTerminator || BufEnd[0] == 0) && "Buffer is not null terminated!"' failed.
Stack dump:

Build Log Line 7434
Error

          
            
0.	/.../root/interpreter/llvm/src/tools/clang/include/clang/StaticAnalyzer/Core/BugReporter/PathDiagnostic.h:17:2: current parser token 'include'
 #0 0x00007fd12b19903a llvm::sys::PrintStackTrace(llvm::raw_ostream&) (/cvmfs/sft.cern.ch/lcg/contrib/llvm/builds/x86_64-centos7-gcc48-opt/clang_build_367044/bin/../lib/libLLVMSupport.so.10svn+0x17903a)
 #1 0x00007fd12b197069 llvm::sys::RunSignalHandlers() (/cvmfs/sft.cern.ch/lcg/contrib/llvm/builds/x86_64-centos7-gcc48-opt/clang_build_367044/bin/../lib/libLLVMSupport.so.10svn+0x177069)
 #2 0x00007fd12b1971a0 SignalHandler(int) (/cvmfs/sft.cern.ch/lcg/contrib/llvm/builds/x86_64-centos7-gcc48-opt/clang_build_367044/bin/../lib/libLLVMSupport.so.10svn+0x1771a0)
 #3 0x00007fd12a6785f0 __restore_rt (/lib64/libpthread.so.0+0xf5f0)
 #4 0x00007fd127bfd337 raise (/lib64/libc.so.6+0x36337)
 #5 0x00007fd127bfea28 abort (/lib64/libc.so.6+0x37a28)
 #6 0x00007fd127bf6156 __assert_fail_base (/lib64/libc.so.6+0x2f156)
 #7 0x00007fd127bf6202 (/lib64/libc.so.6+0x2f202)
 #8 0x00007fd12b11edd2 (/cvmfs/sft.cern.ch/lcg/contrib/llvm/builds/x86_64-centos7-gcc48-opt/clang_build_367044/bin/../lib/libLLVMSupport.so.10svn+0xfedd2)
 #9 0x00007fd12b120fe8 llvm::MemoryBuffer::getOpenFile(int, llvm::Twine const&, unsigned long, bool, bool) (/cvmfs/sft.cern.ch/lcg/contrib/llvm/builds/x86_64-centos7-gcc48-opt/clang_build_367044/bin/../lib/libLLVMSupport.so.10svn+0x100fe8)

Build Log Line 7469
Error
#24 0x00007fd122c2d7e4 clang::Parser::ParseTopLevelDecl(clang::OpaquePtr<clang::DeclGroupRef>&, bool) (/cvmfs/sft.cern.ch/lcg/contrib/llvm/builds/x86_64-centos7-gcc48-opt/clang_build_367044/bin/../lib/../lib/libclangParse.so.10svn+0xc67e4)
#25 0x00007fd122b982dd clang::ParseAST(clang::Sema&, bool, bool) (/cvmfs/sft.cern.ch/lcg/contrib/llvm/builds/x86_64-centos7-gcc48-opt/clang_build_367044/bin/../lib/../lib/libclangParse.so.10svn+0x312dd)
#26 0x00007fd128f70099 clang::FrontendAction::Execute() (/cvmfs/sft.cern.ch/lcg/contrib/llvm/builds/x86_64-centos7-gcc48-opt/clang_build_367044/bin/../lib/libclangFrontend.so.10svn+0xee099)
#27 0x00007fd128f376f1 clang::CompilerInstance::ExecuteAction(clang::FrontendAction&) (/cvmfs/sft.cern.ch/lcg/contrib/llvm/builds/x86_64-centos7-gcc48-opt/clang_build_367044/bin/../lib/libclangFrontend.so.10svn+0xb56f1)
#28 0x00007fd128f37cbc void llvm::function_ref<void ()>::callback_fn<compileModuleImpl(clang::CompilerInstance&, clang::SourceLocation, llvm::StringRef, clang::FrontendInputFile, llvm::StringRef, llvm::StringRef, llvm::function_ref<void (clang::CompilerInstance&)>, llvm::function_ref<void (clang::CompilerInstance&)>)::'lambda0'()>(long) (/cvmfs/sft.cern.ch/lcg/contrib/llvm/builds/x86_64-centos7-gcc48-opt/clang_build_367044/bin/../lib/libclangFrontend.so.10svn+0xb5cbc)
#29 0x00007fd12b0c7297 llvm::CrashRecoveryContext::RunSafely(llvm::function_ref<void ()>) (/cvmfs/sft.cern.ch/lcg/contrib/llvm/builds/x86_64-centos7-gcc48-opt/clang_build_367044/bin/../lib/libLLVMSupport.so.10svn+0xa7297)
#30 0x00007fd12b0c7334 RunSafelyOnThread_Dispatch(void*) (/cvmfs/sft.cern.ch/lcg/contrib/llvm/builds/x86_64-centos7-gcc48-opt/clang_build_367044/bin/../lib/libLLVMSupport.so.10svn+0xa7334)
#31 0x00007fd12b19a13d ExecuteOnThread_Dispatch(void*) (/cvmfs/sft.cern.ch/lcg/contrib/llvm/builds/x86_64-centos7-gcc48-opt/clang_build_367044/bin/../lib/libLLVMSupport.so.10svn+0x17a13d)
#32 0x00007fd12a670e65 start_thread (/lib64/libpthread.so.0+0x7e65)
#33 0x00007fd127cc588d clone (/lib64/libc.so.6+0xfe88d)
clang++: error: unable to execute command: Aborted

        

Build Log Line 7470
Error

          
            
clang++: error: clang frontend command failed due to signal (use -v to see invocation)
clang version 10.0.0 (https://github.com/llvm/llvm-project.git cde00c02e11da2355ec715f571958fa180b17a43)
Target: x86_64-unknown-linux-gnu
Thread model: posix
InstalledDir: /cvmfs/sft.cern.ch/lcg/contrib/llvm/latest/x86_64-centos7-gcc48-opt/bin
clang++: note: diagnostic msg: PLEASE submit a bug report to https://bugs.llvm.org/ and include the crash backtrace, preprocessed source, and associated run script.
While building module 'Cling_Interpreter' imported from /.../root/core/metacling/src/TClingValue.cxx:18:
While building module 'Clang_Frontend' imported from /.../root/interpreter/cling/include/cling/Interpreter/CIFactory.h:13:
In file included from <module-includes>:6:
In file included from /.../root/interpreter/llvm/src/tools/clang/include/clang/Frontend/CompilerInstance.h:16:

Repository https://github.com/root-project/root/blob/master/interpreter/llvm/src/tools/clang/include/clang/Frontend/CompilerInvocation.h
Build Log Line 7480
Error

          
            
/.../root/interpreter/llvm/src/tools/clang/include/clang/Frontend/CompilerInvocation.h:23:2: fatal error: module file '/.../build/include/pcms/1UIHRLRZYAO7L/Clang_Analysis-VV5FUAEWSEAJ.pcm' is out of date and needs to be rebuilt: signature mismatch
#include "clang/StaticAnalyzer/Core/AnalyzerOptions.h"
 ^

Repository https://github.com/root-project/root/blob/master/interpreter/cling/include/cling/Interpreter/CIFactory.h
Build Log Line 7486
Error

          
            
/.../root/interpreter/cling/include/cling/Interpreter/CIFactory.h:13:10: fatal error: could not build module 'Clang_Frontend'
#include "clang/Frontend/CompilerInstance.h"
 ~~~~~~~~^~~~~~~~~~~~~~~~~~~~~~~~~~~~~~~~~~~

Repository https://github.com/root-project/root/blob/master/core/metacling/src/TClingValue.cxx
Build Log Line 7489
Error

          
            
/.../root/core/metacling/src/TClingValue.cxx:18:10: fatal error: could not build module 'Cling_Interpreter'
#include "cling/Interpreter/Value.h"
 ~~~~~~~~^~~~~~~~~~~~~~~~~~~~~~~~~~~
3 errors generated.
clang++: note: diagnostic msg: 
********************

PLEASE ATTACH THE FOLLOWING FILES TO THE BUG REPORT:
Preprocessed source(s) and associated run script(s) are located at:
clang++: note: diagnostic msg: /tmp/sftnight/DictSelectionReader-3e8127.cpp
clang++: note: diagnostic msg: /tmp/sftnight/DictSelectionReader-3e8127.cache

Build Log Line 7506
Error
clang++: note: diagnostic msg: /tmp/sftnight/DictSelectionReader-3e8127.sh
clang++: note: diagnostic msg: 

********************
[ 67%] Built target Dictgen
Scanning dependencies of target rootcling_stage1
gmake[2]: *** No rule to make target `core/dictgen/CMakeFiles/Dictgen.dir/src/DictSelectionReader.cxx.o', needed by `core/rootcling_stage1/src/rootcling_stage1'.  Stop.
gmake[2]: *** Waiting for unfinished jobs....
[ 67%] Building CXX object core/rootcling_stage1/CMakeFiles/rootcling_stage1.dir/src/rootcling_stage1.cxx.o
[ 67%] Built target rootcling_stage1
[ 67%] Generating G__Core.cxx, ../lib/Core.pcm
No such file or directory
Scanning dependencies of target G__Core
[ 67%] Generating G__Core.cxx, ../lib/Core.pcm
No such file or directory
[ 67%] Building CXX object core/CMakeFiles/G__Core.dir/G__Core.cxx.o

Build Log Line 7516
Error

          
            
clang++: error: no such file or directory: '/.../build/core/G__Core.cxx'

        

Build Log Line 7517
Error

          
            
clang++: error: no input files
[ 67%] Built target G__Core
Scanning dependencies of target Core

Build Log Line 7520
Error

          
            
gmake[2]: *** No rule to make target `core/CMakeFiles/G__Core.dir/G__Core.cxx.o', needed by `lib/libCore.so'.  Stop.
[ 67%] Built target Core

Build Log Line 7522
Error

          
            
gmake[2]: *** No rule to make target `lib/libCore.so', needed by `core/rint/G__Rint.cxx'.  Stop.

        

Build Log Line 7523
Error

          
            
gmake[2]: *** No rule to make target `lib/libCore.so', needed by `core/clingutils/G__complexDict.cxx'.  Stop.

        

Build Log Line 7524
Error

          
            
gmake[2]: *** No rule to make target `lib/libCore.so', needed by `core/clingutils/G__unordered_setDict.cxx'.  Stop.

        

Build Log Line 7525
Error

          
            
gmake[2]: *** No rule to make target `lib/libCore.so', needed by `core/thread/G__Thread.cxx'.  Stop.

        

Build Log Line 7526
Error

          
            
gmake[2]: *** No rule to make target `lib/libCore.so', needed by `core/clingutils/G__multisetDict.cxx'.  Stop.

        

Build Log Line 7527
Error

          
            
gmake[2]: *** No rule to make target `lib/libCore.so', needed by `core/clingutils/G__setDict.cxx'.  Stop.

        

Build Log Line 7528
Error

          
            
gmake[2]: *** No rule to make target `lib/libCore.so', needed by `core/clingutils/G__dequeDict.cxx'.  Stop.

        

Build Log Line 7529
Error

          
            
gmake[2]: *** No rule to make target `lib/libCore.so', needed by `core/clingutils/G__listDict.cxx'.  Stop.

        

Build Log Line 7530
Error

          
            
gmake[2]: *** No rule to make target `lib/libCore.so', needed by `core/clingutils/G__unordered_multisetDict.cxx'.  Stop.

        

Build Log Line 7531
Error

          
            
gmake[2]: *** No rule to make target `lib/libCore.so', needed by `core/clingutils/G__forward_listDict.cxx'.  Stop.

        

Build Log Line 7532
Error

          
            
gmake[2]: *** No rule to make target `lib/libCore.so', needed by `core/clingutils/G__multimapDict.cxx'.  Stop.

        

Build Log Line 7533
Error

          
            
gmake[2]: *** No rule to make target `lib/libCore.so', needed by `core/rint/G__Rint.cxx'.  Stop.

        

Build Log Line 7534
Error

          
            
gmake[2]: *** No rule to make target `lib/libCore.so', needed by `core/clingutils/G__vectorDict.cxx'.  Stop.

        

Build Log Line 7535
Error

          
            
gmake[2]: *** No rule to make target `lib/libCore.so', needed by `core/clingutils/G__map2Dict.cxx'.  Stop.

        

Build Log Line 7536
Error

          
            
gmake[2]: *** No rule to make target `lib/libCore.so', needed by `core/clingutils/G__complexDict.cxx'.  Stop.

        

Build Log Line 7537
Error

          
            
gmake[2]: *** No rule to make target `lib/libCore.so', needed by `core/clingutils/G__mapDict.cxx'.  Stop.

        

Build Log Line 7538
Error

          
            
gmake[2]: *** No rule to make target `lib/libCore.so', needed by `core/clingutils/G__unordered_setDict.cxx'.  Stop.

        

Build Log Line 7539
Error

          
            
gmake[2]: *** No rule to make target `lib/libCore.so', needed by `core/clingutils/G__multisetDict.cxx'.  Stop.

        

Build Log Line 7540
Error

          
            
gmake[2]: *** No rule to make target `lib/libCore.so', needed by `core/clingutils/G__setDict.cxx'.  Stop.

        

Build Log Line 7541
Error

          
            
gmake[2]: *** No rule to make target `lib/libCore.so', needed by `core/clingutils/G__dequeDict.cxx'.  Stop.

        

Build Log Line 7542
Error

          
            
gmake[2]: *** No rule to make target `lib/libCore.so', needed by `core/clingutils/G__listDict.cxx'.  Stop.

        

Build Log Line 7543
Error

          
            
gmake[2]: *** No rule to make target `lib/libCore.so', needed by `core/thread/G__Thread.cxx'.  Stop.

        

Build Log Line 7544
Error

          
            
gmake[2]: *** No rule to make target `lib/libCore.so', needed by `core/clingutils/G__unordered_mapDict.cxx'.  Stop.

        

Build Log Line 7545
Error

          
            
gmake[2]: *** No rule to make target `lib/libCore.so', needed by `core/clingutils/G__multimap2Dict.cxx'.  Stop.

        

Build Log Line 7546
Error

          
            
gmake[2]: *** No rule to make target `lib/libCore.so', needed by `core/clingutils/G__unordered_multisetDict.cxx'.  Stop.

        

Build Log Line 7547
Error

          
            
gmake[2]: *** No rule to make target `lib/libCore.so', needed by `core/clingutils/G__forward_listDict.cxx'.  Stop.

        

Build Log Line 7548
Error

          
            
gmake[2]: *** No rule to make target `lib/libCore.so', needed by `core/clingutils/G__multimapDict.cxx'.  Stop.

        

Build Log Line 7549
Error

          
            
gmake[2]: *** No rule to make target `lib/libCore.so', needed by `core/clingutils/G__vectorDict.cxx'.  Stop.

        

Build Log Line 7550
Error

          
            
gmake[2]: *** No rule to make target `lib/libCore.so', needed by `core/clingutils/G__map2Dict.cxx'.  Stop.

        

Build Log Line 7551
Error

          
            
gmake[2]: *** No rule to make target `lib/libCore.so', needed by `core/clingutils/G__valarrayDict.cxx'.  Stop.

        

Build Log Line 7552
Error

          
            
gmake[2]: *** No rule to make target `lib/libCore.so', needed by `core/clingutils/G__mapDict.cxx'.  Stop.

        

Build Log Line 7553
Error

          
            
gmake[2]: *** No rule to make target `lib/libCore.so', needed by `core/clingutils/G__unordered_mapDict.cxx'.  Stop.

        

Build Log Line 7554
Error

          
            
gmake[2]: *** No rule to make target `lib/libCore.so', needed by `core/clingutils/G__unordered_multimapDict.cxx'.  Stop.
gmake[2]: *** No rule to make target `lib/libCore.so', needed by `core/clingutils/G__multimap2Dict.cxx'.  Stop.
[ 67%] Built target G__valarrayDict
[ 67%] Built target G__unordered_multisetDict
[ 67%] Built target G__vectorDict
[ 67%] Built target G__dequeDict
[ 67%] Built target G__multimapDict
[ 67%] Built target G__listDict
[ 67%] Built target G__mapDict
[ 67%] Built target G__multisetDict
[ 67%] Built target G__unordered_multimapDict
The maximum number of reported warnings or errors has been reached!!!