Site: sft-ubuntu-1804-3
Build Name: v6-18-00-patches-x86_64-ubuntu18-clang91-opt
Build Time: 2019-11-13T23:22:41 UTC
Found 8 Errors
Warnings are here.

Build Log Line 7103
Error

          
            
0.	/.../root/interpreter/cling/include/cling/Interpreter/CIFactory.h:13:2: current parser token 'include'
 #0 0x00007f859dc3410a llvm::sys::PrintStackTrace(llvm::raw_ostream&) (/cvmfs/sft.cern.ch/lcg/contrib/llvm/builds/x86_64-ubuntu1804-gcc7-opt/clang_build_375507/bin/../lib/libLLVMSupport.so.10svn+0x19610a)
 #1 0x00007f859dc31dd4 llvm::sys::RunSignalHandlers() (/cvmfs/sft.cern.ch/lcg/contrib/llvm/builds/x86_64-ubuntu1804-gcc7-opt/clang_build_375507/bin/../lib/libLLVMSupport.so.10svn+0x193dd4)
 #2 0x00007f859dc31f12 SignalHandler(int) (/cvmfs/sft.cern.ch/lcg/contrib/llvm/builds/x86_64-ubuntu1804-gcc7-opt/clang_build_375507/bin/../lib/libLLVMSupport.so.10svn+0x193f12)
 #3 0x00007f859ad8cf20 (/lib/x86_64-linux-gnu/libc.so.6+0x3ef20)
 #4 0x00007f859dbaa994 llvm::MemoryBuffer::init(char const*, char const*, bool) (/cvmfs/sft.cern.ch/lcg/contrib/llvm/builds/x86_64-ubuntu1804-gcc7-opt/clang_build_375507/bin/../lib/libLLVMSupport.so.10svn+0x10c994)
 #5 0x00007f859dbac676 llvm::ErrorOr<std::unique_ptr<llvm::MemoryBuffer, std::default_delete<llvm::MemoryBuffer> > > getOpenFileImpl<llvm::MemoryBuffer>(int, llvm::Twine const&, unsigned long, unsigned long, long, bool, bool) (/cvmfs/sft.cern.ch/lcg/contrib/llvm/builds/x86_64-ubuntu1804-gcc7-opt/clang_build_375507/bin/../lib/libLLVMSupport.so.10svn+0x10e676)
 #6 0x00007f859dbacbff llvm::MemoryBuffer::getOpenFile(int, llvm::Twine const&, unsigned long, bool, bool) (/cvmfs/sft.cern.ch/lcg/contrib/llvm/builds/x86_64-ubuntu1804-gcc7-opt/clang_build_375507/bin/../lib/libLLVMSupport.so.10svn+0x10ebff)
 #7 0x00007f859dbe9863 (anonymous namespace)::RealFile::getBuffer(llvm::Twine const&, long, bool, bool) (/cvmfs/sft.cern.ch/lcg/contrib/llvm/builds/x86_64-ubuntu1804-gcc7-opt/clang_build_375507/bin/../lib/libLLVMSupport.so.10svn+0x14b863)
 #8 0x00007f859dbee6db llvm::vfs::FileSystem::getBufferForFile(llvm::Twine const&, long, bool, bool) (/cvmfs/sft.cern.ch/lcg/contrib/llvm/builds/x86_64-ubuntu1804-gcc7-opt/clang_build_375507/bin/../lib/libLLVMSupport.so.10svn+0x1506db)
 #9 0x00007f859ce49bbf clang::FileManager::getBufferForFileImpl(llvm::StringRef, long, bool) (/cvmfs/sft.cern.ch/lcg/contrib/llvm/builds/x86_64-ubuntu1804-gcc7-opt/clang_build_375507/bin/../lib/libclangBasic.so.10svn+0x26fbbf)

Build Log Line 7136
Error
#22 0x00007f8595707e81 clang::Parser::ParseTopLevelDecl(clang::OpaquePtr<clang::DeclGroupRef>&, bool) (/cvmfs/sft.cern.ch/lcg/contrib/llvm/builds/x86_64-ubuntu1804-gcc7-opt/clang_build_375507/bin/../lib/../lib/libclangParse.so.10svn+0xdfe81)
#23 0x00007f8595658899 clang::ParseAST(clang::Sema&, bool, bool) (/cvmfs/sft.cern.ch/lcg/contrib/llvm/builds/x86_64-ubuntu1804-gcc7-opt/clang_build_375507/bin/../lib/../lib/libclangParse.so.10svn+0x30899)
#24 0x00007f859bc036c9 clang::FrontendAction::Execute() (/cvmfs/sft.cern.ch/lcg/contrib/llvm/builds/x86_64-ubuntu1804-gcc7-opt/clang_build_375507/bin/../lib/libclangFrontend.so.10svn+0xec6c9)
#25 0x00007f859bbbca1a clang::CompilerInstance::ExecuteAction(clang::FrontendAction&) (/cvmfs/sft.cern.ch/lcg/contrib/llvm/builds/x86_64-ubuntu1804-gcc7-opt/clang_build_375507/bin/../lib/libclangFrontend.so.10svn+0xa5a1a)
#26 0x00007f859bbbd35f void llvm::function_ref<void ()>::callback_fn<compileModuleImpl(clang::CompilerInstance&, clang::SourceLocation, llvm::StringRef, clang::FrontendInputFile, llvm::StringRef, llvm::StringRef, llvm::function_ref<void (clang::CompilerInstance&)>, llvm::function_ref<void (clang::CompilerInstance&)>)::'lambda0'()>(long) (/cvmfs/sft.cern.ch/lcg/contrib/llvm/builds/x86_64-ubuntu1804-gcc7-opt/clang_build_375507/bin/../lib/libclangFrontend.so.10svn+0xa635f)
#27 0x00007f859db460c3 llvm::CrashRecoveryContext::RunSafely(llvm::function_ref<void ()>) (/cvmfs/sft.cern.ch/lcg/contrib/llvm/builds/x86_64-ubuntu1804-gcc7-opt/clang_build_375507/bin/../lib/libLLVMSupport.so.10svn+0xa80c3)
#28 0x00007f859db461c4 RunSafelyOnThread_Dispatch(void*) (/cvmfs/sft.cern.ch/lcg/contrib/llvm/builds/x86_64-ubuntu1804-gcc7-opt/clang_build_375507/bin/../lib/libLLVMSupport.so.10svn+0xa81c4)
#29 0x00007f859dc3577d ExecuteOnThread_Dispatch(void*) (/cvmfs/sft.cern.ch/lcg/contrib/llvm/builds/x86_64-ubuntu1804-gcc7-opt/clang_build_375507/bin/../lib/libLLVMSupport.so.10svn+0x19777d)
#30 0x00007f85986ca6db start_thread (/lib/x86_64-linux-gnu/libpthread.so.0+0x76db)
#31 0x00007f859ae6f88f clone /build/glibc-OTsEL5/glibc-2.27/misc/../sysdeps/unix/sysv/linux/x86_64/clone.S:97:0
clang++: error: unable to execute command: Bus error (core dumped)

        

Build Log Line 7137
Error

          
            
clang++: error: clang frontend command failed due to signal (use -v to see invocation)
clang version 10.0.0 (https://github.com/llvm/llvm-project.git 68f5ca4e19c16f12895a6f0b9fbabc1d86c4b6b0)
Target: x86_64-unknown-linux-gnu
Thread model: posix
InstalledDir: /cvmfs/sft.cern.ch/lcg/contrib/llvm/latest/x86_64-ubuntu1804-gcc7-opt/bin
clang++: note: diagnostic msg: PLEASE submit a bug report to https://bugs.llvm.org/ and include the crash backtrace, preprocessed source, and associated run script.
5 warnings generated.
[ 68%] Built target ClingUtils
[ 68%] Building CXX object core/metacling/src/CMakeFiles/MetaCling.dir/TClingValue.cxx.o
[ 68%] Built target Dictgen
Scanning dependencies of target rootcling_stage1

Repository https://github.com/root-project/root/blob/master//mnt/build/night/LABEL/ROOT-ubuntu1804-clangHEAD/SPEC/cxxmod-noimt/V/6-18/build/core/metacling/src/CMakeFiles/MetaCling.dir/build.make
Build Log Line 7736
Error
********************

PLEASE ATTACH THE FOLLOWING FILES TO THE BUG REPORT:
Preprocessed source(s) and associated run script(s) are located at:
clang++: note: diagnostic msg: /tmp/TClingMethodInfo-97d44b.cpp
clang++: note: diagnostic msg: /tmp/TClingMethodInfo-97d44b.cache
clang++: note: diagnostic msg: /tmp/TClingMethodInfo-97d44b.sh
clang++: note: diagnostic msg: 

********************
core/metacling/src/CMakeFiles/MetaCling.dir/build.make:278: recipe for target 'core/metacling/src/CMakeFiles/MetaCling.dir/TClingMethodInfo.cxx.o' failed

        

Build Log Line 7737
Error

          
            
make[2]: *** [core/metacling/src/CMakeFiles/MetaCling.dir/TClingMethodInfo.cxx.o] Error 254

        

Repository https://github.com/root-project/root/blob/master//mnt/build/night/LABEL/ROOT-ubuntu1804-clangHEAD/SPEC/cxxmod-noimt/V/6-18/build/CMakeFiles/Makefile2
Build Log Line 7738
Error

          
            
CMakeFiles/Makefile2:18701: recipe for target 'core/metacling/src/CMakeFiles/MetaCling.dir/all' failed

        

Build Log Line 7739
Error

          
            
make[1]: *** [core/metacling/src/CMakeFiles/MetaCling.dir/all] Error 2
make[1]: *** Waiting for unfinished jobs....
[ 70%] Built target RIOObjs
Makefile:162: recipe for target 'all' failed

Build Log Line 7743
Error

          
            
make: *** [all] Error 2