Site Name: macitois21.cern.ch
Build Name: master-x86_64-mac1014-clang100-opt-exp-rtcxxmod (view notes)
Stamp: 20191114-0359-Experimental (related builds)
Time: 2019-11-14T04:01:07 UTC
Type: Experimental

OS Name: Mac OS X
OS Platform: x86_64
OS Release: 10.14.6
OS Version: 18G1012
CTest version: ctest-3.14.4

Current Build
StageErrorsWarnings
Update
Configure0
Build62
Test00
Previous Build
StageErrorsWarnings
Update00
Configure0
Build62
Test00

History
Show Build History
Build History Filter

Notes
Add a Note to this Build

Graph
Show Build Graphs

Configure (0 errors, warnings)

Start Time: 2019-12-16T04:55:40 UTC
End Time: 2019-12-16T04:55:40 UTC
Configure Command:
Configure Return Value:
Configure Output:

View Configure Summary

Build (6 errors, 2 warnings)

Build command: /usr/local/Cellar/cmake/3.14.4/bin/cmake --build . --config "Release" -- -j8
Start Time: 2019-11-14T04:01:07 UTC
End Time: 2019-11-14T04:09:07 UTC


Build Log line 7793


File: /Library/Developer/CommandLineTools/SDKs/MacOSX10.14.sdk/usr/include/stdlib.h Line: 118
[ 73%] Built target coremetaclingtestUnit
[ 73%] Generating G__SillyStruct.cxx, SillyStruct.pcm
While building module 'MathCore':
While building module '_Builtin_intrinsics' imported from /.../build/include/Vc/scalar/../common/../sse/intrinsics.h:34:
In file included from <module-includes>:2:
In file included from /.../build/etc//cling/lib/clang/5.0.0/include/immintrin.h:32:
In file included from /.../build/etc//cling/lib/clang/5.0.0/include/xmmintrin.h:39:
In file included from /.../build/etc//cling/lib/clang/5.0.0/include/mm_malloc.h:27:
In file included from /Library/Developer/CommandLineTools/usr/include/c++/v1/stdlib.h:94:
In file included from /.../build/etc//cling/lib/clang/5.0.0/include/stdlib.h:8:
/Library/Developer/CommandLineTools/SDKs/MacOSX10.14.sdk/usr/include/stdlib.h:118:12: error: declaration of '__mb_cur_max' has a different language linkage
extern int __mb_cur_max;
           ^

Build Log line 7808


File: include/Vc/scalar/../common/../sse/intrinsics.h Line: 34
In file included from /.../build/include/Vc/sse/vector.h:32:
/.../build/include/Vc/scalar/../common/../sse/intrinsics.h:34:10: fatal error: could not build module '_Builtin_intrinsics'
#include <x86intrin.h>
 ~~~~~~~~^
[ 73%] Built target coreclingutilstestUnit
Scanning dependencies of target G__XMLParser
[ 73%] Building CXX object io/xmlparser/CMakeFiles/G__XMLParser.dir/G__XMLParser.cxx.o
Scanning dependencies of target G__XMLIO
[ 73%] Building CXX object io/xml/CMakeFiles/G__XMLIO.dir/G__XMLIO.cxx.o
Scanning dependencies of target G__RHTTP
Scanning dependencies of target G__Net
[ 73%] Building CXX object net/http/CMakeFiles/G__RHTTP.dir/G__RHTTP.cxx.o
[ 73%] Building CXX object net/net/CMakeFiles/G__Net.dir/G__Net.cxx.o
Error: /.../build/bin/rootcling: compilation failure (/.../build/lib/libMathCoreb74cc08c41_dictUmbrella.h)
make[2]: *** [math/mathcore/G__MathCore.cxx] Error 1
make[1]: *** [math/mathcore/CMakeFiles/G__MathCore.dir/all] Error 2
make[1]: *** Waiting for unfinished jobs....
[ 73%] Built target G__XMLParser
[ 73%] Built target G__XMLIO
Scanning dependencies of target G__SillyStruct
[ 73%] Building CXX object tree/tree/test/CMakeFiles/G__SillyStruct.dir/G__SillyStruct.cxx.o
[ 73%] Built target G__Net
[ 73%] Built target G__RHTTP
Scanning dependencies of target G__ROOTVecOps
[ 73%] Building CXX object math/vecops/CMakeFiles/G__ROOTVecOps.dir/G__ROOTVecOps.cxx.o
[ 73%] Built target G__SillyStruct
[ 73%] Built target G__ROOTVecOps
make: *** [all] Error 2
View Errors Summary

Build Warnings (2)

Build Log line 7796


File: /Library/Developer/CommandLineTools/SDKs/MacOSX10.14.sdk/usr/include/stdlib.h Line: 118
/Library/Developer/CommandLineTools/SDKs/MacOSX10.14.sdk/usr/include/stdlib.h:118:12: note: previous declaration is here
extern int __mb_cur_max;
           ^
Module Darwin not found.
In file included from input_line_21:3:
In file included from /.../build/include/Fit/BasicFCN.h:18:
In file included from /.../build/include/Math/IParamFunction.h:20:
In file included from /.../build/include/Math/Util.h:28:
In file included from /.../build/include/Math/Types.h:18:
In file included from /.../build/include/Vc/Vc:30:
In file included from /.../build/include/Vc/vector.h:35:
*** WARNING non-zero return value in ctest from: /usr/local/Cellar/cmake/3.14.4/bin/cmake

View Warnings Summary

Test (0 passed, 0 failed, 0 not run)
View Tests Summary