Build summary for ROOT starting at Saturday, December 07 2019 22:00:00

Group:

Errors:

master-x86_64-centos7-clang100-opt-master: In file included from /.../root/math/mathcore/src/FitUtil.cxx/cvmfs/sft.cern.ch/lcg/contrib/llvm/builds/x86_64-centos7-gcc48-opt/clang_build_367044/lib/clang/10.0.0/include/ia32intrin.h::72:913: :
master-x86_64-centos7-clang100-opt-cxxmodules: clang++: /mnt/build/jenkins/workspace/root-install-latest-clang-build/LABEL/ROOT-centos7-gcc62/SPEC/default/clang_build_367044/src/llvm/lib/Support/MemoryBuffer.cpp:48: void llvm::MemoryBuffer::init(const char*, const char*, bool): Assertion `(!RequiresNullTerminator || BufEnd[0] == 0) && "Buffer is not null terminated!"' failed.
master-x86_64-centos7-clang100-opt-cxxmodules: 0. /.../root/interpreter/llvm/src/tools/clang/include/clang/StaticAnalyzer/Core/BugReporter/PathDiagnostic.h:17:2: current parser token 'include'
master-x86_64-centos7-clang100-opt-cxxmodules: clang++: error: unable to execute command: Aborted
master-x86_64-centos7-clang100-opt-cxxmodules: clang++: error: clang frontend command failed due to signal (use -v to see invocation)
master-x86_64-centos7-clang100-opt-cxxmodules: 0. /.../root/interpreter/llvm/src/tools/clang/include/clang/Parse/RAIIObjectsForParser.h:18:2: current parser token 'include'
master-x86_64-centos7-clang100-opt-cxxmodules: clang++: error: unable to execute command: Bus error
master-x86_64-centos7-clang100-opt-cxxmodules: clang++: error: clang frontend command failed due to signal (use -v to see invocation)
master-x86_64-centos7-clang100-opt-cxxmodules: 0. /.../root/interpreter/cling/include/cling/Utils/ParserStateRAII.h:14:2: current parser token 'include'
master-x86_64-centos7-clang100-opt-cxxmodules: clang++: error: unable to execute command: Bus error
master-x86_64-centos7-clang100-opt-cxxmodules: clang++: error: clang frontend command failed due to signal (use -v to see invocation)
master-x86_64-centos7-clang100-opt-cxxmodules: gmake[2]: *** No rule to make target `core/clingutils/CMakeFiles/ClingUtils.dir/src/TClingUtils.cxx.o', needed by `core/rootcling_stage1/src/rootcling_stage1'. Stop.
master-x86_64-centos7-clang100-opt-cxxmodules: clang++: error: no such file or directory: '/.../build/core/G__Core.cxx'
master-x86_64-centos7-clang100-opt-cxxmodules: clang++: error: no input files
master-x86_64-centos7-clang100-opt-cxxmodules: gmake[2]: *** No rule to make target `core/CMakeFiles/G__Core.dir/G__Core.cxx.o', needed by `lib/libCore.so'. Stop.
master-x86_64-centos7-clang100-opt-cxxmodules: gmake[2]: *** No rule to make target `lib/libCore.so', needed by `core/rint/G__Rint.cxx'. Stop.
master-x86_64-centos7-clang100-opt-cxxmodules: gmake[2]: *** No rule to make target `lib/libCore.so', needed by `core/clingutils/G__complexDict.cxx'. Stop.
master-x86_64-centos7-clang100-opt-cxxmodules: gmake[2]: *** gmake[2]: *** No rule to make target `lib/libCore.so', needed by `core/thread/G__Thread.cxx'No rule to make target `lib/libCore.so', needed by `core/clingutils/G__unordered_setDict.cxx'. Stop.
master-x86_64-centos7-clang100-opt-cxxmodules: gmake[2]: *** No rule to make target `lib/libCore.so', needed by `core/clingutils/G__multisetDict.cxx'. Stop.
master-x86_64-centos7-clang100-opt-cxxmodules: gmake[2]: *** gmake[2]: *** No rule to make target `lib/libCore.so', needed by `core/clingutils/G__setDict.cxx'No rule to make target `lib/libCore.so', needed by `core/clingutils/G__vectorDict.cxx'. Stop.
master-x86_64-centos7-clang100-opt-cxxmodules: gmake[2]: *** No rule to make target `lib/libCore.so', needed by `core/clingutils/G__unordered_multisetDict.cxx'. Stop.
master-x86_64-centos7-clang100-opt-cxxmodules: gmake[2]: *** No rule to make target `lib/libCore.so', needed by `core/rint/G__Rint.cxx'. Stop.
master-x86_64-centos7-clang100-opt-cxxmodules: gmake[2]: *** No rule to make target `lib/libCore.so', needed by `core/clingutils/G__forward_listDict.cxx'. Stop.
master-x86_64-centos7-clang100-opt-cxxmodules: gmake[2]: *** No rule to make target `lib/libCore.so', needed by `core/clingutils/G__multimapDict.cxx'. Stop.
master-x86_64-centos7-clang100-opt-cxxmodules: gmake[2]: *** gmake[2]: *** No rule to make target `lib/libCore.so', needed by `core/clingutils/G__mapDict.cxx'No rule to make target `lib/libCore.so', needed by `core/clingutils/G__complexDict.cxx'. Stop.
master-x86_64-centos7-clang100-opt-cxxmodules: gmake[2]: *** No rule to make target `lib/libCore.so', needed by `core/clingutils/G__map2Dict.cxx'. Stop.
master-x86_64-centos7-clang100-opt-cxxmodules: gmake[2]: *** No rule to make target `lib/libCore.so', needed by `core/clingutils/G__unordered_setDict.cxx'. Stop.
master-x86_64-centos7-clang100-opt-cxxmodules: gmake[2]: *** No rule to make target `lib/libCore.so', needed by `core/clingutils/G__unordered_mapDict.cxx'. Stop.
master-x86_64-centos7-clang100-opt-cxxmodules: gmake[2]: *** No rule to make target `lib/libCore.so', needed by `core/thread/G__Thread.cxx'. Stop.
master-x86_64-centos7-clang100-opt-cxxmodules: gmake[2]: *** No rule to make target `lib/libCore.so', needed by `core/clingutils/G__multimap2Dict.cxx'. Stop.
master-x86_64-centos7-clang100-opt-cxxmodules: gmake[2]: *** No rule to make target `lib/libCore.so', needed by `core/clingutils/G__multisetDict.cxx'. Stop.
master-x86_64-centos7-clang100-opt-cxxmodules: gmake[2]: *** No rule to make target `lib/libCore.so', needed by `core/clingutils/G__setDict.cxx'. Stop.
master-x86_64-centos7-clang100-opt-cxxmodules: gmake[2]: *** gmake[2]: *** No rule to make target `lib/libCore.so', needed by `core/clingutils/G__dequeDict.cxx'. Stop.
master-x86_64-centos7-clang100-opt-cxxmodules: gmake[2]: *** No rule to make target `lib/libCore.so', needed by `core/clingutils/G__vectorDict.cxx'. Stop.
master-x86_64-centos7-clang100-opt-cxxmodules: gmake[2]: *** No rule to make target `lib/libCore.so', needed by `core/clingutils/G__unordered_multisetDict.cxx'. Stop.
master-x86_64-centos7-clang100-opt-cxxmodules: gmake[2]: *** No rule to make target `lib/libCore.so', needed by `core/clingutils/G__forward_listDict.cxx'. Stop.
master-x86_64-centos7-clang100-opt-cxxmodules: gmake[2]: *** No rule to make target `lib/libCore.so', needed by `core/clingutils/G__multimapDict.cxx'. Stop.
master-x86_64-centos7-clang100-opt-cxxmodules: gmake[2]: *** No rule to make target `lib/libCore.so', needed by `core/clingutils/G__valarrayDict.cxx'. Stop.
master-x86_64-centos7-clang100-opt-cxxmodules: gmake[2]: *** No rule to make target `lib/libCore.so', needed by `core/clingutils/G__mapDict.cxx'. Stop.
master-x86_64-centos7-clang100-opt-cxxmodules: gmake[2]: *** No rule to make target `lib/libCore.so', needed by `core/clingutils/G__map2Dict.cxx'. Stop.
master-x86_64-centos7-clang100-opt-cxxmodules: gmake[2]: *** No rule to make target `lib/libCore.so', needed by `core/clingutils/G__unordered_multimapDict.cxx'. Stop.
master-x86_64-centos7-clang100-opt-cxxmodules: gmake[2]: *** No rule to make target `lib/libCore.so', needed by `core/clingutils/G__unordered_mapDict.cxx'. Stop.
master-x86_64-centos7-clang100-opt-cxxmodules: gmake[2]: *** No rule to make target `lib/libCore.so', needed by `core/clingutils/G__multimap2Dict.cxx'. Stop.
master-x86_64-centos7-clang100-opt-cxxmodules: gmake[2]: *** No rule to make target `lib/libCore.so', needed by `core/clingutils/G__valarrayDict.cxx'. Stop.
master-x86_64-centos7-clang100-opt-cxxmodules: gmake[2]: *** No rule to make target `lib/libCore.so', needed by `core/clingutils/G__unordered_multimapDict.cxx'. Stop.
master-x86_64-centos7-clang100-opt-cxxmodules: gmake[2]: *** No rule to make target `lib/libCore.so', needed by `core/foundation/test/testNotFn'. Stop.
master-x86_64-centos7-clang100-opt-cxxmodules: gmake[2]: *** No rule to make target `lib/libCore.so', needed by `core/foundation/test/testMake_unique'. Stop.
master-x86_64-centos7-clang100-opt-cxxmodules: gmake[2]: *** No rule to make target `lib/libCore.so', needed by `lib/libJupyROOT.so'. Stop.
master-x86_64-centos7-clang100-opt-cxxmodules: gmake[2]: *** No rule to make target `lib/libCore.so', needed by `test/stressIterators'. Stop.
master-x86_64-centos7-clang100-opt-cxxmodules: gmake[2]: *** No rule to make target `math/mathcore/CMakeFiles/G__MathCore.dir/G__MathCore.cxx.o', needed by `lib/libMathCore.so'. Stop.
master-x86_64-centos7-clang100-opt-cxxmodules: gmake[2]: *** No rule to make target `lib/libMathCore.so', needed by `math/smatrix/G__Smatrix32.cxx'. Stop.
master-x86_64-centos7-clang100-opt-cxxmodules: gmake[2]: *** No rule to make target `lib/libMathCore.so', needed by `math/fftw/G__FFTW.cxx'. Stop.
master-x86_64-centos7-clang100-opt-cxxmodules: gmake[2]: *** No rule to make target `lib/libMathCore.so', needed by `math/genvector/G__GenVector32.cxx'. Stop.
master-x86_64-centos7-clang100-opt-cxxmodules: gmake[2]: *** No rule to make target `lib/libMathCore.so', needed by `math/mathmore/G__MathMore.cxx'. Stop.
master-x86_64-centos7-clang100-opt-cxxmodules: gmake[2]: *** No rule to make target `lib/libMathCore.so', needed by `graf3d/csg/G__RCsg.cxx'. Stop.
master-x86_64-centos7-clang100-opt-cxxmodules: gmake[2]: *** No rule to make target `lib/libMathCore.so', needed by `math/matrix/G__Matrix.cxx'. Stop.
master-x86_64-centos7-clang100-opt-cxxmodules: gmake[2]: *** No rule to make target `lib/libMathCore.so', needed by `math/smatrix/G__Smatrix32.cxx'. Stop.
master-x86_64-centos7-clang100-opt-cxxmodules: gmake[2]: *** No rule to make target `lib/libMathCore.so', needed by `geom/geom/G__Geom.cxx'. Stop.
master-x86_64-centos7-clang100-opt-cxxmodules: gmake[2]: *** No rule to make target `lib/libMathCore.so', needed by `math/fftw/G__FFTW.cxx'. Stop.
master-x86_64-centos7-clang100-opt-cxxmodules: gmake[2]: *** No rule to make target `lib/libMathCore.so', needed by `math/genvector/G__GenVector32.cxx'. Stop.
master-x86_64-centos7-clang100-opt-cxxmodules: gmake[2]: *** No rule to make target `lib/libMathCore.so', needed by `graf3d/csg/G__RCsg.cxx'. Stop.
master-x86_64-centos7-clang100-opt-cxxmodules: gmake[2]: *** No rule to make target `lib/libMathCore.so', needed by `math/matrix/G__Matrix.cxx'. Stop.
master-x86_64-centos7-clang100-opt-cxxmodules: gmake[2]: *** No rule to make target `lib/libMathCore.so', needed by `math/mathmore/G__MathMore.cxx'. Stop.
master-x86_64-centos7-clang100-opt-cxxmodules: gmake[2]: *** No rule to make target `lib/libMathCore.so', needed by `geom/geom/G__Geom.cxx'. Stop.
master-x86_64-centos7-clang100-opt-cxxmodules: gmake[2]: *** No rule to make target `lib/libMathCore.so', needed by `math/genvector/G__GenVector.cxx'. Stop.
master-x86_64-centos7-clang100-opt-cxxmodules: gmake[2]: *** No rule to make target `lib/libMathCore.so', needed by `math/genvector/G__GenVector.cxx'. Stop.
master-x86_64-centos7-clang100-opt-cxxmodules: gmake[2]: *** No rule to make target `lib/libMathCore.so', needed by `bin/proofserv.exe'. Stop.
master-x86_64-centos7-clang100-opt-cxxmodules: gmake[2]: *** No rule to make target `lib/libMathCore.so', needed by `bin/rootn.exe'. Stop.
master-x86_64-centos7-clang100-opt-cxxmodules: gmake[2]: *** No rule to make target `lib/libMathCore.so', needed by `test/ctorture'. Stop.
master-x86_64-centos7-clang100-opt-cxxmodules: gmake[2]: *** No rule to make target `lib/libMathCore.so', needed by `test/tcollbm'. Stop.
master-x86_64-centos7-clang100-opt-cxxmodules: gmake[2]: *** No rule to make target `lib/libMathCore.so', needed by `bin/roots.exe'. Stop.
master-x86_64-centos7-clang100-opt-cxxmodules: gmake[2]: *** No rule to make target `lib/libMathCore.so', needed by `math/mathcore/test/CladDerivatorTests'. Stop.
master-x86_64-centos7-clang100-opt-cxxmodules: gmake[2]: *** No rule to make target `lib/libMathCore.so', needed by `math/smatrix/G__Smatrix.cxx'. Stop.
master-x86_64-centos7-clang100-opt-cxxmodules: gmake[2]: *** No rule to make target `lib/libMathCore.so', needed by `math/smatrix/G__Smatrix.cxx'. Stop.
master-x86_64-centos7-clang100-opt-cxxmodules: gmake[2]: *** No rule to make target `math/fftw/CMakeFiles/G__FFTW.dir/G__FFTW.cxx.o', needed by `lib/libFFTW.so'. Stop.
master-x86_64-centos7-clang100-opt-cxxmodules: gmake[2]: *** No rule to make target `graf3d/csg/CMakeFiles/G__RCsg.dir/G__RCsg.cxx.o', needed by `lib/libRCsg.so'. Stop.
master-x86_64-centos7-clang100-opt-cxxmodules: gmake[2]: *** No rule to make target `lib/libMathCore.so', needed by `rootbench/root/math/mathcore/MathcoreBenchmarks'. Stop.
master-x86_64-centos7-clang100-opt-cxxmodules: gmake[2]: *** No rule to make target `math/genvector/CMakeFiles/G__GenVector.dir/G__GenVector.cxx.o', needed by `lib/libGenVector.so'. Stop.
master-x86_64-centos7-clang100-opt-cxxmodules: gmake[2]: *** No rule to make target `lib/libMathCore.so', needed by `math/mathcore/test/VectorizedTMathUnit'. Stop.
master-x86_64-centos7-clang100-opt-cxxmodules: gmake[2]: *** No rule to make target `lib/libMathCore.so', needed by `math/mathcore/test/testKahan'. Stop.
master-x86_64-centos7-clang100-opt-cxxmodules: gmake[2]: *** No rule to make target `math/smatrix/CMakeFiles/G__Smatrix.dir/G__Smatrix.cxx.o', needed by `lib/libSmatrix.so'. Stop.
master-x86_64-centos7-clang100-opt-cxxmodules: gmake[2]: *** No rule to make target `math/matrix/CMakeFiles/G__Matrix.dir/G__Matrix.cxx.o', needed by `lib/libMatrix.so'. Stop.
master-x86_64-centos7-clang100-opt-cxxmodules: gmake[2]: *** No rule to make target `lib/libMathCore.so', needed by `math/mathcore/test/G__TrackMathCoreUnitDict.cxx'. Stop.
master-x86_64-centos7-clang100-opt-cxxmodules: gmake[2]: *** No rule to make target `lib/libMathCore.so', needed by `math/mathcore/test/G__TrackMathCoreUnitDict.cxx'. Stop.
master-x86_64-centos7-clang100-opt-cxxmodules: gmake[2]: *** No rule to make target `lib/libMathCore.so', needed by `test/G__TrackMathCoreDict.cxx'. Stop.
master-x86_64-centos7-clang100-opt-cxxmodules: gmake[2]: *** No rule to make target `lib/libMathCore.so', needed by `test/G__TrackMathCoreDict.cxx'. Stop.
master-x86_64-centos7-clang100-opt-cxxmodules: gmake[2]: *** No rule to make target `lib/libGenVector.so', needed by `rootbench/root/math/genvector/GenVectorBenchmarks'. Stop.
master-x86_64-centos7-clang100-opt-cxxmodules: gmake[2]: *** No rule to make target `math/mathcore/test/CMakeFiles/G__TrackMathCoreUnitDict.dir/G__TrackMathCoreUnitDict.cxx.o', needed by `math/mathcore/test/libTrackMathCoreUnitDict.so'. Stop.
master-x86_64-centos7-clang100-opt-cxxmodules: gmake[2]: *** No rule to make target `test/CMakeFiles/G__TrackMathCoreDict.dir/G__TrackMathCoreDict.cxx.o', needed by `test/libTrackMathCoreDict.so'. Stop.
master-x86_64-centos7-clang100-opt-cxxmodules: gmake[2]: *** No rule to make target `math/mathmore/CMakeFiles/G__MathMore.dir/G__MathMore.cxx.o', needed by `lib/libMathMore.so'. Stop.
master-x86_64-centos7-clang100-opt-cxxmodules: gmake[2]: *** No rule to make target `geom/geom/CMakeFiles/G__Geom.dir/G__Geom.cxx.o', needed by `lib/libGeom.so'. Stop.
master-x86_64-centos7-clang100-opt-cxxmodules: gmake[2]: *** No rule to make target `lib/libMatrix.so', needed by `math/physics/G__Physics.cxx'. Stop.
master-x86_64-centos7-clang100-opt-cxxmodules: gmake[2]: *** No rule to make target `lib/libMatrix.so', needed by `math/quadp/G__Quadp.cxx'. Stop.
master-x86_64-centos7-clang100-opt-cxxmodules: gmake[2]: *** No rule to make target `lib/libMatrix.so', needed by `bindings/r/G__RInterface.cxx'. Stop.
master-x86_64-centos7-clang100-opt-cxxmodules: gmake[2]: *** No rule to make target `lib/libMathCore.so', needed by `hist/hist/G__Hist.cxx'. Stop.
master-x86_64-centos7-clang100-opt-cxxmodules: gmake[2]: *** No rule to make target `lib/libMatrix.so', needed by `math/physics/G__Physics.cxx'. Stop.
master-x86_64-centos7-clang100-opt-cxxmodules: gmake[2]: *** No rule to make target `lib/libMatrix.so', needed by `math/quadp/G__Quadp.cxx'. Stop.

Warnings:

master-x86_64-mac1014-clang100-opt-exp-cxxmod: Warning: Unused class rule: TMacOSXSystem
master-x86_64-mac1013-clang100: ld: warning: text-based stub file /System/Library/Frameworks//Cocoa.framework/Cocoa.tbd and library file /System/Library/Frameworks//Cocoa.framework/Cocoa are out of sync. Falling back to library file for linking.
master-x86_64-mac1013-clang100: ld: warning: text-based stub file /System/Library/Frameworks/OpenGL.framework/Versions/A/Libraries/libGL.tbd and library file /System/Library/Frameworks/OpenGL.framework/Versions/A/Libraries/libGL.dylib are out of sync. Falling back to library file for linking.
master-x86_64-mac1013-clang100: ld: warning: text-based stub file /System/Library/Frameworks/OpenGL.framework/Versions/A/Libraries/libGLU.tbd and library file /System/Library/Frameworks/OpenGL.framework/Versions/A/Libraries/libGLU.dylib are out of sync. Falling back to library file for linking.
master-x86_64-mac1013-clang100: ld: warning: text-based stub file /System/Library/Frameworks//AppKit.framework/Versions/C/AppKit.tbd and library file /System/Library/Frameworks//AppKit.framework/Versions/C/AppKit are out of sync. Falling back to library file for linking.
master-x86_64-mac1013-clang100: ld: warning: text-based stub file /System/Library/PrivateFrameworks/UIFoundation.framework/Versions/A/UIFoundation.tbd and library file /System/Library/PrivateFrameworks/UIFoundation.framework/Versions/A/UIFoundation are out of sync. Falling back to library file for linking.
master-x86_64-mac1013-clang100: ld: warning: text-based stub file /System/Library/Frameworks//ApplicationServices.framework/Versions/A/ApplicationServices.tbd and library file /System/Library/Frameworks//ApplicationServices.framework/Versions/A/ApplicationServices are out of sync. Falling back to library file for linking.
master-x86_64-mac1013-clang100: ld: warning: text-based stub file /System/Library/Frameworks//Foundation.framework/Versions/C/Foundation.tbd and library file /System/Library/Frameworks//Foundation.framework/Versions/C/Foundation are out of sync. Falling back to library file for linking.
master-x86_64-mac1013-clang100: ld: warning: text-based stub file /System/Library/Frameworks//CoreGraphics.framework/Versions/A/CoreGraphics.tbd and library file /System/Library/Frameworks//CoreGraphics.framework/Versions/A/CoreGraphics are out of sync. Falling back to library file for linking.
master-x86_64-mac1013-clang100: ld: warning: text-based stub file /System/Library/Frameworks/OpenGL.framework/Versions/A/Libraries/libGL.tbd and library file /System/Library/Frameworks/OpenGL.framework/Versions/A/Libraries/libGL.dylib are out of sync. Falling back to library file for linking.
master-x86_64-mac1013-clang100: ld: warning: text-based stub file /System/Library/Frameworks/OpenGL.framework/Versions/A/Libraries/libGLU.tbd and library file /System/Library/Frameworks/OpenGL.framework/Versions/A/Libraries/libGLU.dylib are out of sync. Falling back to library file for linking.
master-x86_64-mac1013-clang100: ld: warning: text-based stub file /System/Library/Frameworks//CoreText.framework/Versions/A/CoreText.tbd and library file /System/Library/Frameworks//CoreText.framework/Versions/A/CoreText are out of sync. Falling back to library file for linking.
master-x86_64-mac1013-clang100: ld: warning: text-based stub file /System/Library/Frameworks//ImageIO.framework/Versions/A/ImageIO.tbd and library file /System/Library/Frameworks//ImageIO.framework/Versions/A/ImageIO are out of sync. Falling back to library file for linking.
master-x86_64-mac1013-clang100: ld: warning: text-based stub file /System/Library/Frameworks/ApplicationServices.framework/Versions/A/Frameworks/ATS.framework/Versions/A/ATS.tbd and library file /System/Library/Frameworks/ApplicationServices.framework/Versions/A/Frameworks/ATS.framework/Versions/A/ATS are out of sync. Falling back to library file for linking.
master-x86_64-mac1013-clang100: ld: warning: text-based stub file /System/Library/Frameworks//CoreServices.framework/Versions/A/CoreServices.tbd and library file /System/Library/Frameworks//CoreServices.framework/Versions/A/CoreServices are out of sync. Falling back to library file for linking.
master-x86_64-mac1013-clang100: ld: warning: text-based stub file /System/Library/Frameworks/ApplicationServices.framework/Versions/A/Frameworks/HIServices.framework/Versions/A/HIServices.tbd and library file /System/Library/Frameworks/ApplicationServices.framework/Versions/A/Frameworks/HIServices.framework/Versions/A/HIServices are out of sync. Falling back to library file for linking.
master-x86_64-mac1013-clang100: ld: warning: text-based stub file /System/Library/Frameworks/ApplicationServices.framework/Versions/A/Frameworks/SpeechSynthesis.framework/Versions/A/SpeechSynthesis.tbd and library file /System/Library/Frameworks/ApplicationServices.framework/Versions/A/Frameworks/SpeechSynthesis.framework/Versions/A/SpeechSynthesis are out of sync. Falling back to library file for linking.
master-x86_64-mac1013-clang100: ld: warning: text-based stub file /System/Library/Frameworks//CoreFoundation.framework/Versions/A/CoreFoundation.tbd and library file /System/Library/Frameworks//CoreFoundation.framework/Versions/A/CoreFoundation are out of sync. Falling back to library file for linking.
master-x86_64-mac1013-clang100: ld: warning: text-based stub file /System/Library/Frameworks//CFNetwork.framework/Versions/A/CFNetwork.tbd and library file /System/Library/Frameworks//CFNetwork.framework/Versions/A/CFNetwork are out of sync. Falling back to library file for linking.
master-x86_64-mac1013-clang100: ld: warning: text-based stub file /System/Library/Frameworks/CoreServices.framework/Versions/A/Frameworks/CarbonCore.framework/Versions/A/CarbonCore.tbd and library file /System/Library/Frameworks/CoreServices.framework/Versions/A/Frameworks/CarbonCore.framework/Versions/A/CarbonCore are out of sync. Falling back to library file for linking.
master-x86_64-mac1013-clang100: ld: warning: text-based stub file /System/Library/Frameworks/CoreServices.framework/Versions/A/Frameworks/Metadata.framework/Versions/A/Metadata.tbd and library file /System/Library/Frameworks/CoreServices.framework/Versions/A/Frameworks/Metadata.framework/Versions/A/Metadata are out of sync. Falling back to library file for linking.
master-x86_64-mac1013-clang100: ld: warning: text-based stub file /System/Library/Frameworks/CoreServices.framework/Versions/A/Frameworks/OSServices.framework/Versions/A/OSServices.tbd and library file /System/Library/Frameworks/CoreServices.framework/Versions/A/Frameworks/OSServices.framework/Versions/A/OSServices are out of sync. Falling back to library file for linking.
master-x86_64-mac1013-clang100: ld: warning: text-based stub file /System/Library/Frameworks/CoreServices.framework/Versions/A/Frameworks/AE.framework/Versions/A/AE.tbd and library file /System/Library/Frameworks/CoreServices.framework/Versions/A/Frameworks/AE.framework/Versions/A/AE are out of sync. Falling back to library file for linking.
master-x86_64-mac1013-clang100: ld: warning: text-based stub file /System/Library/Frameworks/CoreServices.framework/Versions/A/Frameworks/LaunchServices.framework/Versions/A/LaunchServices.tbd and library file /System/Library/Frameworks/CoreServices.framework/Versions/A/Frameworks/LaunchServices.framework/Versions/A/LaunchServices are out of sync. Falling back to library file for linking.
master-x86_64-mac1013-clang100: ld: warning: text-based stub file /System/Library/Frameworks/CoreServices.framework/Versions/A/Frameworks/SharedFileList.framework/Versions/A/SharedFileList.tbd and library file /System/Library/Frameworks/CoreServices.framework/Versions/A/Frameworks/SharedFileList.framework/Versions/A/SharedFileList are out of sync. Falling back to library file for linking.
master-x86_64-mac1013-clang100: ld: warning: text-based stub file /System/Library/Frameworks//Cocoa.framework/Cocoa.tbd and library file /System/Library/Frameworks//Cocoa.framework/Cocoa are out of sync. Falling back to library file for linking.
master-x86_64-mac1013-clang100: ld: warning: text-based stub file /System/Library/PrivateFrameworks/CoreSymbolication.framework/CoreSymbolication.tbd and library file /System/Library/PrivateFrameworks/CoreSymbolication.framework/CoreSymbolication are out of sync. Falling back to library file for linking.
master-x86_64-mac1013-clang100: ld: warning: text-based stub file /System/Library/Frameworks//AppKit.framework/Versions/C/AppKit.tbd and library file /System/Library/Frameworks//AppKit.framework/Versions/C/AppKit are out of sync. Falling back to library file for linking.
master-x86_64-mac1013-clang100: ld: warning: text-based stub file /System/Library/PrivateFrameworks/UIFoundation.framework/Versions/A/UIFoundation.tbd and library file /System/Library/PrivateFrameworks/UIFoundation.framework/Versions/A/UIFoundation are out of sync. Falling back to library file for linking.
master-x86_64-mac1013-clang100: ld: warning: text-based stub file /System/Library/Frameworks//ApplicationServices.framework/Versions/A/ApplicationServices.tbd and library file /System/Library/Frameworks//ApplicationServices.framework/Versions/A/ApplicationServices are out of sync. Falling back to library file for linking.
master-x86_64-mac1013-clang100: ld: warning: text-based stub file /System/Library/Frameworks//Foundation.framework/Versions/C/Foundation.tbd and library file /System/Library/Frameworks//Foundation.framework/Versions/C/Foundation are out of sync. Falling back to library file for linking.
master-x86_64-mac1013-clang100: ld: warning: text-based stub file /System/Library/Frameworks//CoreGraphics.framework/Versions/A/CoreGraphics.tbd and library file /System/Library/Frameworks//CoreGraphics.framework/Versions/A/CoreGraphics are out of sync. Falling back to library file for linking.
master-x86_64-mac1013-clang100: ld: warning: text-based stub file /System/Library/Frameworks//CoreText.framework/Versions/A/CoreText.tbd and library file /System/Library/Frameworks//CoreText.framework/Versions/A/CoreText are out of sync. Falling back to library file for linking.
master-x86_64-mac1013-clang100: ld: warning: text-based stub file /System/Library/Frameworks//ImageIO.framework/Versions/A/ImageIO.tbd and library file /System/Library/Frameworks//ImageIO.framework/Versions/A/ImageIO are out of sync. Falling back to library file for linking.
master-x86_64-mac1013-clang100: ld: warning: text-based stub file /System/Library/Frameworks/ApplicationServices.framework/Versions/A/Frameworks/ATS.framework/Versions/A/ATS.tbd and library file /System/Library/Frameworks/ApplicationServices.framework/Versions/A/Frameworks/ATS.framework/Versions/A/ATS are out of sync. Falling back to library file for linking.
master-x86_64-mac1013-clang100: ld: warning: text-based stub file /System/Library/Frameworks//CoreServices.framework/Versions/A/CoreServices.tbd and library file /System/Library/Frameworks//CoreServices.framework/Versions/A/CoreServices are out of sync. Falling back to library file for linking.
master-x86_64-mac1013-clang100: ld: warning: text-based stub file /System/Library/Frameworks/ApplicationServices.framework/Versions/A/Frameworks/HIServices.framework/Versions/A/HIServices.tbd and library file /System/Library/Frameworks/ApplicationServices.framework/Versions/A/Frameworks/HIServices.framework/Versions/A/HIServices are out of sync. Falling back to library file for linking.
master-x86_64-mac1013-clang100: ld: warning: text-based stub file /System/Library/Frameworks/ApplicationServices.framework/Versions/A/Frameworks/SpeechSynthesis.framework/Versions/A/SpeechSynthesis.tbd and library file /System/Library/Frameworks/ApplicationServices.framework/Versions/A/Frameworks/SpeechSynthesis.framework/Versions/A/SpeechSynthesis are out of sync. Falling back to library file for linking.
master-x86_64-mac1013-clang100: ld: warning: text-based stub file /System/Library/Frameworks//CoreFoundation.framework/Versions/A/CoreFoundation.tbd and library file /System/Library/Frameworks//CoreFoundation.framework/Versions/A/CoreFoundation are out of sync. Falling back to library file for linking.
master-x86_64-mac1013-clang100: ld: warning: text-based stub file /System/Library/Frameworks//CFNetwork.framework/Versions/A/CFNetwork.tbd and library file /System/Library/Frameworks//CFNetwork.framework/Versions/A/CFNetwork are out of sync. Falling back to library file for linking.
master-x86_64-mac1013-clang100: ld: warning: text-based stub file /System/Library/Frameworks/CoreServices.framework/Versions/A/Frameworks/CarbonCore.framework/Versions/A/CarbonCore.tbd and library file /System/Library/Frameworks/CoreServices.framework/Versions/A/Frameworks/CarbonCore.framework/Versions/A/CarbonCore are out of sync. Falling back to library file for linking.
master-x86_64-mac1013-clang100: ld: warning: text-based stub file /System/Library/Frameworks/CoreServices.framework/Versions/A/Frameworks/Metadata.framework/Versions/A/Metadata.tbd and library file /System/Library/Frameworks/CoreServices.framework/Versions/A/Frameworks/Metadata.framework/Versions/A/Metadata are out of sync. Falling back to library file for linking.
master-x86_64-mac1013-clang100: ld: warning: text-based stub file /System/Library/Frameworks/CoreServices.framework/Versions/A/Frameworks/OSServices.framework/Versions/A/OSServices.tbd and library file /System/Library/Frameworks/CoreServices.framework/Versions/A/Frameworks/OSServices.framework/Versions/A/OSServices are out of sync. Falling back to library file for linking.
master-x86_64-mac1013-clang100: ld: warning: text-based stub file /System/Library/Frameworks/CoreServices.framework/Versions/A/Frameworks/AE.framework/Versions/A/AE.tbd and library file /System/Library/Frameworks/CoreServices.framework/Versions/A/Frameworks/AE.framework/Versions/A/AE are out of sync. Falling back to library file for linking.
master-x86_64-mac1013-clang100: ld: warning: text-based stub file /System/Library/Frameworks/CoreServices.framework/Versions/A/Frameworks/LaunchServices.framework/Versions/A/LaunchServices.tbd and library file /System/Library/Frameworks/CoreServices.framework/Versions/A/Frameworks/LaunchServices.framework/Versions/A/LaunchServices are out of sync. Falling back to library file for linking.
master-x86_64-mac1013-clang100: ld: warning: text-based stub file /System/Library/Frameworks/CoreServices.framework/Versions/A/Frameworks/SharedFileList.framework/Versions/A/SharedFileList.tbd and library file /System/Library/Frameworks/CoreServices.framework/Versions/A/Frameworks/SharedFileList.framework/Versions/A/SharedFileList are out of sync. Falling back to library file for linking.
master-x86_64-mac1013-clang100: ld: warning: text-based stub file /System/Library/Frameworks//Cocoa.framework/Cocoa.tbd and library file /System/Library/Frameworks//Cocoa.framework/Cocoa are out of sync. Falling back to library file for linking.
master-x86_64-mac1013-clang100: ld: warning: text-based stub file /System/Library/Frameworks//AppKit.framework/Versions/C/AppKit.tbd and library file /System/Library/Frameworks//AppKit.framework/Versions/C/AppKit are out of sync. Falling back to library file for linking.
master-x86_64-mac1013-clang100: ld: warning: text-based stub file /System/Library/PrivateFrameworks/UIFoundation.framework/Versions/A/UIFoundation.tbd and library file /System/Library/PrivateFrameworks/UIFoundation.framework/Versions/A/UIFoundation are out of sync. Falling back to library file for linking.
master-x86_64-mac1013-clang100: ld: warning: text-based stub file /System/Library/Frameworks//ApplicationServices.framework/Versions/A/ApplicationServices.tbd and library file /System/Library/Frameworks//ApplicationServices.framework/Versions/A/ApplicationServices are out of sync. Falling back to library file for linking.
master-x86_64-mac1013-clang100: ld: warning: text-based stub file /System/Library/Frameworks//Foundation.framework/Versions/C/Foundation.tbd and library file /System/Library/Frameworks//Foundation.framework/Versions/C/Foundation are out of sync. Falling back to library file for linking.
v6-18-00-patches-x86-winxp-vc16-opt: C:\build\night\LABEL\windows10\SPEC\default\V\6-18\root\interpreter\llvm\src\include\llvm/DebugInfo/CodeView/SymbolRecordMapping.h(43,1): warning C4266: 'llvm::Error llvm::codeview::SymbolVisitorCallbacks::visitSymbolBegin(llvm::codeview::CVSymbol &,uint32_t)': no override available for virtual member function from base 'llvm::codeview::SymbolVisitorCallbacks'; function is hidden (compiling source file C:\build\night\LABEL\windows10\SPEC\default\V\6-18\root\interpreter\llvm\src\lib\DebugInfo\CodeView\SymbolSerializer.cpp) [C:\build\night\LABEL\windows10\SPEC\default\V\6-18\build\interpreter\llvm\src\lib\DebugInfo\CodeView\LLVMDebugInfoCodeView.vcxproj]
v6-18-00-patches-x86-winxp-vc16-opt: C:\build\night\LABEL\windows10\SPEC\default\V\6-18\root\interpreter\llvm\src\include\llvm/DebugInfo/CodeView/SymbolRecordMapping.h(43,1): warning C4266: 'llvm::Error llvm::codeview::SymbolVisitorCallbacks::visitSymbolBegin(llvm::codeview::CVSymbol &,uint32_t)': no override available for virtual member function from base 'llvm::codeview::SymbolVisitorCallbacks'; function is hidden (compiling source file C:\build\night\LABEL\windows10\SPEC\default\V\6-18\root\interpreter\llvm\src\lib\DebugInfo\CodeView\SymbolRecordMapping.cpp) [C:\build\night\LABEL\windows10\SPEC\default\V\6-18\build\interpreter\llvm\src\lib\DebugInfo\CodeView\LLVMDebugInfoCodeView.vcxproj]
v6-18-00-patches-x86-winxp-vc16-opt: C:\build\night\LABEL\windows10\SPEC\default\V\6-18\root\interpreter\llvm\src\include\llvm/DebugInfo/CodeView/SymbolRecordMapping.h(43,1): warning C4266: 'llvm::Error llvm::codeview::SymbolVisitorCallbacks::visitSymbolBegin(llvm::codeview::CVSymbol &,uint32_t)': no override available for virtual member function from base 'llvm::codeview::SymbolVisitorCallbacks'; function is hidden (compiling source file C:\build\night\LABEL\windows10\SPEC\default\V\6-18\root\interpreter\llvm\src\lib\DebugInfo\CodeView\SymbolDumper.cpp) [C:\build\night\LABEL\windows10\SPEC\default\V\6-18\build\interpreter\llvm\src\lib\DebugInfo\CodeView\LLVMDebugInfoCodeView.vcxproj]
v6-18-00-patches-x86-winxp-vc16-opt: C:\build\night\LABEL\windows10\SPEC\default\V\6-18\root\interpreter\llvm\src\include\llvm/DebugInfo/CodeView/SymbolSerializer.h(76,1): warning C4266: 'llvm::Error llvm::codeview::SymbolVisitorCallbacks::visitSymbolBegin(llvm::codeview::CVSymbol &,uint32_t)': no override available for virtual member function from base 'llvm::codeview::SymbolVisitorCallbacks'; function is hidden (compiling source file C:\build\night\LABEL\windows10\SPEC\default\V\6-18\root\interpreter\llvm\src\lib\DebugInfo\CodeView\SymbolSerializer.cpp) [C:\build\night\LABEL\windows10\SPEC\default\V\6-18\build\interpreter\llvm\src\lib\DebugInfo\CodeView\LLVMDebugInfoCodeView.vcxproj]
v6-18-00-patches-x86-winxp-vc16-opt: C:\build\night\LABEL\windows10\SPEC\default\V\6-18\root\interpreter\llvm\src\lib\DebugInfo\CodeView\SymbolDumper.cpp(62,1): warning C4266: 'llvm::Error llvm::codeview::SymbolVisitorCallbacks::visitSymbolBegin(llvm::codeview::CVSymbol &,uint32_t)': no override available for virtual member function from base 'llvm::codeview::SymbolVisitorCallbacks'; function is hidden [C:\build\night\LABEL\windows10\SPEC\default\V\6-18\build\interpreter\llvm\src\lib\DebugInfo\CodeView\LLVMDebugInfoCodeView.vcxproj]
v6-18-00-patches-x86-winxp-vc16-opt: C:\build\night\LABEL\windows10\SPEC\default\V\6-18\root\interpreter\llvm\src\lib\MC\MCMachOStreamer.cpp(111,1): warning C4266: 'void llvm::MCObjectStreamer::EmitLabel(llvm::MCSymbol *,llvm::SMLoc,llvm::MCFragment *)': no override available for virtual member function from base 'llvm::MCObjectStreamer'; function is hidden [C:\build\night\LABEL\windows10\SPEC\default\V\6-18\build\interpreter\llvm\src\lib\MC\LLVMMC.vcxproj]
v6-18-00-patches-x86-winxp-vc16-opt: C:\build\night\LABEL\windows10\SPEC\default\V\6-18\root\interpreter\llvm\src\include\llvm/MC/MCWinCOFFStreamer.h(76,1): warning C4266: 'void llvm::MCObjectStreamer::EmitLabel(llvm::MCSymbol *,llvm::SMLoc,llvm::MCFragment *)': no override available for virtual member function from base 'llvm::MCObjectStreamer'; function is hidden (compiling source file C:\build\night\LABEL\windows10\SPEC\default\V\6-18\root\interpreter\llvm\src\lib\MC\MCWinCOFFStreamer.cpp) [C:\build\night\LABEL\windows10\SPEC\default\V\6-18\build\interpreter\llvm\src\lib\MC\LLVMMC.vcxproj]
v6-18-00-patches-x86-winxp-vc16-opt: C:\build\night\LABEL\windows10\SPEC\default\V\6-18\root\interpreter\llvm\src\lib\MC\WinCOFFObjectWriter.cpp(207,1): warning C4266: 'bool llvm::MCObjectWriter::isSymbolRefDifferenceFullyResolvedImpl(const llvm::MCAssembler &,const llvm::MCSymbol &,const llvm::MCSymbol &,bool) const': no override available for virtual member function from base 'llvm::MCObjectWriter'; function is hidden [C:\build\night\LABEL\windows10\SPEC\default\V\6-18\build\interpreter\llvm\src\lib\MC\LLVMMC.vcxproj]
v6-18-00-patches-x86-winxp-vc16-opt: C:\build\night\LABEL\windows10\SPEC\default\V\6-18\root\interpreter\llvm\src\lib\Transforms\Coroutines\CoroSplit.cpp(733,1): warning C4266: 'bool llvm::Pass::doInitialization(llvm::Module &)': no override available for virtual member function from base 'llvm::Pass'; function is hidden [C:\build\night\LABEL\windows10\SPEC\default\V\6-18\build\interpreter\llvm\src\lib\Transforms\Coroutines\LLVMCoroutines.vcxproj]
v6-18-00-patches-x86-winxp-vc16-opt: C:\build\night\LABEL\windows10\SPEC\default\V\6-18\root\interpreter\llvm\src\include\llvm/Transforms/IPO/Inliner.h(78,1): warning C4266: 'bool llvm::Pass::doInitialization(llvm::Module &)': no override available for virtual member function from base 'llvm::Pass'; function is hidden (compiling source file C:\build\night\LABEL\windows10\SPEC\default\V\6-18\root\interpreter\llvm\src\lib\Transforms\IPO\AlwaysInliner.cpp) [C:\build\night\LABEL\windows10\SPEC\default\V\6-18\build\interpreter\llvm\src\lib\Transforms\IPO\LLVMipo.vcxproj]
v6-18-00-patches-x86-winxp-vc16-opt: C:\build\night\LABEL\windows10\SPEC\default\V\6-18\root\interpreter\llvm\src\include\llvm/Transforms/IPO/Inliner.h(78,1): warning C4266: 'bool llvm::Pass::doInitialization(llvm::Module &)': no override available for virtual member function from base 'llvm::Pass'; function is hidden (compiling source file C:\build\night\LABEL\windows10\SPEC\default\V\6-18\root\interpreter\llvm\src\lib\Transforms\IPO\InlineSimple.cpp) [C:\build\night\LABEL\windows10\SPEC\default\V\6-18\build\interpreter\llvm\src\lib\Transforms\IPO\LLVMipo.vcxproj]
v6-18-00-patches-x86-winxp-vc16-opt: C:\build\night\LABEL\windows10\SPEC\default\V\6-18\root\interpreter\llvm\src\include\llvm/Transforms/IPO/Inliner.h(78,1): warning C4266: 'bool llvm::Pass::doInitialization(llvm::Module &)': no override available for virtual member function from base 'llvm::Pass'; function is hidden (compiling source file C:\build\night\LABEL\windows10\SPEC\default\V\6-18\root\interpreter\llvm\src\lib\Transforms\IPO\Inliner.cpp) [C:\build\night\LABEL\windows10\SPEC\default\V\6-18\build\interpreter\llvm\src\lib\Transforms\IPO\LLVMipo.vcxproj]
v6-18-00-patches-x86-winxp-vc16-opt: C:\build\night\LABEL\windows10\SPEC\default\V\6-18\root\interpreter\llvm\src\include\llvm/Transforms/IPO/Inliner.h(78,1): warning C4266: 'bool llvm::Pass::doInitialization(llvm::Module &)': no override available for virtual member function from base 'llvm::Pass'; function is hidden [C:\build\night\LABEL\windows10\SPEC\default\V\6-18\build\interpreter\llvm\src\lib\Passes\LLVMPasses.vcxproj]
v6-18-00-patches-x86-winxp-vc16-opt: C:\build\night\LABEL\windows10\SPEC\default\V\6-18\root\interpreter\llvm\src\lib\Transforms\Scalar\StructurizeCFG.cpp(243,1): warning C4266: 'bool llvm::Pass::doInitialization(llvm::Module &)': no override available for virtual member function from base 'llvm::Pass'; function is hidden [C:\build\night\LABEL\windows10\SPEC\default\V\6-18\build\interpreter\llvm\src\lib\Transforms\Scalar\LLVMScalarOpts.vcxproj]
v6-18-00-patches-x86-winxp-vc16-opt: C:\build\night\LABEL\windows10\SPEC\default\V\6-18\root\interpreter\llvm\src\include\llvm/CodeGen/ScoreboardHazardRecognizer.h(124,1): warning C4266: 'void llvm::ScheduleHazardRecognizer::EmitInstruction(llvm::MachineInstr *)': no override available for virtual member function from base 'llvm::ScheduleHazardRecognizer'; function is hidden (compiling source file C:\build\night\LABEL\windows10\SPEC\default\V\6-18\root\interpreter\llvm\src\lib\CodeGen\ScoreboardHazardRecognizer.cpp) [C:\build\night\LABEL\windows10\SPEC\default\V\6-18\build\interpreter\llvm\src\lib\CodeGen\LLVMCodeGen.vcxproj]
v6-18-00-patches-x86-winxp-vc16-opt: C:\build\night\LABEL\windows10\SPEC\default\V\6-18\root\interpreter\llvm\src\include\llvm/MC/MCWinCOFFStreamer.h(76,1): warning C4266: 'void llvm::MCObjectStreamer::EmitLabel(llvm::MCSymbol *,llvm::SMLoc,llvm::MCFragment *)': no override available for virtual member function from base 'llvm::MCObjectStreamer'; function is hidden (compiling source file C:\build\night\LABEL\windows10\SPEC\default\V\6-18\root\interpreter\llvm\src\lib\Target\X86\MCTargetDesc\X86WinCOFFStreamer.cpp) [C:\build\night\LABEL\windows10\SPEC\default\V\6-18\build\interpreter\llvm\src\lib\Target\X86\MCTargetDesc\LLVMX86Desc.vcxproj]
v6-18-00-patches-x86-winxp-vc16-opt: C:\build\night\LABEL\windows10\SPEC\default\V\6-18\root\interpreter\llvm\src\lib\Target\X86\AsmParser\X86AsmParser.cpp(878,1): warning C4266: 'bool llvm::MCTargetAsmParser::ParseInstruction(llvm::ParseInstructionInfo &,llvm::StringRef,llvm::AsmToken,llvm::OperandVector &)': no override available for virtual member function from base 'llvm::MCTargetAsmParser'; function is hidden [C:\build\night\LABEL\windows10\SPEC\default\V\6-18\build\interpreter\llvm\src\lib\Target\X86\AsmParser\LLVMX86AsmParser.vcxproj]
v6-18-00-patches-x86-winxp-vc16-opt: C:\build\night\LABEL\windows10\SPEC\default\V\6-18\root\interpreter\llvm\src\include\llvm/CodeGen/ScoreboardHazardRecognizer.h(124,1): warning C4266: 'void llvm::ScheduleHazardRecognizer::EmitInstruction(llvm::MachineInstr *)': no override available for virtual member function from base 'llvm::ScheduleHazardRecognizer'; function is hidden (compiling source file C:\build\night\LABEL\windows10\SPEC\default\V\6-18\root\interpreter\llvm\src\lib\CodeGen\TargetInstrInfo.cpp) [C:\build\night\LABEL\windows10\SPEC\default\V\6-18\build\interpreter\llvm\src\lib\CodeGen\LLVMCodeGen.vcxproj]
v6-18-00-patches-x86-winxp-vc16-opt: C:\build\night\LABEL\windows10\SPEC\default\V\6-18\root\interpreter\llvm\src\include\llvm/Transforms/IPO/Inliner.h(78,1): warning C4266: 'bool llvm::Pass::doInitialization(llvm::Module &)': no override available for virtual member function from base 'llvm::Pass'; function is hidden (compiling source file C:\build\night\LABEL\windows10\SPEC\default\V\6-18\root\interpreter\cling\lib\Interpreter\BackendPasses.cpp) [C:\build\night\LABEL\windows10\SPEC\default\V\6-18\build\interpreter\llvm\src\tools\cling\lib\Interpreter\obj.clingInterpreter.vcxproj]
v6-18-00-patches-x86-winxp-vc16-opt: C:\Program Files (x86)\Windows Kits\10\Include\10.0.17763.0\ucrt\ctype.h(183,110): warning C4090: 'function': different 'const' qualifiers [C:\build\night\LABEL\windows10\SPEC\default\V\6-18\build\build\rmkdepend.vcxproj]
v6-18-00-patches-x86-winxp-vc16-opt: C:\Program Files (x86)\Windows Kits\10\Include\10.0.17763.0\ucrt\corecrt_wstdlib.h(377,10): warning C4028: formal parameter 1 different from declaration [C:\build\night\LABEL\windows10\SPEC\default\V\6-18\build\build\rmkdepend.vcxproj]
v6-18-00-patches-x86-winxp-vc16-opt: C:\Program Files (x86)\Windows Kits\10\Include\10.0.17763.0\ucrt\stdlib.h(232,65): warning C4028: formal parameter 1 different from declaration [C:\build\night\LABEL\windows10\SPEC\default\V\6-18\build\build\rmkdepend.vcxproj]
v6-18-00-patches-x86-winxp-vc16-opt: C:\build\night\LABEL\windows10\SPEC\default\V\6-18\root\interpreter\llvm\src\include\llvm/Support/MathExtras.h(372,31): warning C4146: unary minus operator applied to unsigned type, result still unsigned [C:\build\night\LABEL\windows10\SPEC\default\V\6-18\build\core\clingutils\ClingUtils.vcxproj]
v6-18-00-patches-x86-winxp-vc16-opt: C:\build\night\LABEL\windows10\SPEC\default\V\6-18\root\interpreter\llvm\src\tools\clang\include\clang/AST/Expr.h(4717,34): warning C4146: unary minus operator applied to unsigned type, result still unsigned [C:\build\night\LABEL\windows10\SPEC\default\V\6-18\build\core\clingutils\ClingUtils.vcxproj]
v6-18-00-patches-x86-winxp-vc16-opt: C:\build\night\LABEL\windows10\SPEC\default\V\6-18\root\interpreter\llvm\src\include\llvm/Support/MathExtras.h(372,31): warning C4146: unary minus operator applied to unsigned type, result still unsigned [C:\build\night\LABEL\windows10\SPEC\default\V\6-18\build\core\clingutils\ClingUtils.vcxproj]
v6-18-00-patches-x86-winxp-vc16-opt: C:\build\night\LABEL\windows10\SPEC\default\V\6-18\root\interpreter\llvm\src\tools\clang\include\clang/AST/Expr.h(4717,34): warning C4146: unary minus operator applied to unsigned type, result still unsigned [C:\build\night\LABEL\windows10\SPEC\default\V\6-18\build\core\clingutils\ClingUtils.vcxproj]
v6-18-00-patches-x86-winxp-vc16-opt: C:\build\night\LABEL\windows10\SPEC\default\V\6-18\root\interpreter\llvm\src\include\llvm/Support/MathExtras.h(372,31): warning C4146: unary minus operator applied to unsigned type, result still unsigned [C:\build\night\LABEL\windows10\SPEC\default\V\6-18\build\core\dictgen\Dictgen.vcxproj]
v6-18-00-patches-x86-winxp-vc16-opt: C:\build\night\LABEL\windows10\SPEC\default\V\6-18\root\interpreter\llvm\src\include\llvm/Support/MathExtras.h(372,31): warning C4146: unary minus operator applied to unsigned type, result still unsigned [C:\build\night\LABEL\windows10\SPEC\default\V\6-18\build\core\metacling\src\MetaCling.vcxproj]
v6-18-00-patches-x86-winxp-vc16-opt: C:\build\night\LABEL\windows10\SPEC\default\V\6-18\root\interpreter\llvm\src\tools\clang\include\clang/AST/Expr.h(4717,34): warning C4146: unary minus operator applied to unsigned type, result still unsigned [C:\build\night\LABEL\windows10\SPEC\default\V\6-18\build\core\metacling\src\MetaCling.vcxproj]
v6-18-00-patches-x86-winxp-vc16-opt: C:\build\night\LABEL\windows10\SPEC\default\V\6-18\root\interpreter\llvm\src\include\llvm/ADT/StringExtras.h(59,13): warning C4146: unary minus operator applied to unsigned type, result still unsigned [C:\build\night\LABEL\windows10\SPEC\default\V\6-18\build\core\metacling\src\MetaCling.vcxproj]
v6-18-00-patches-x86-winxp-vc16-opt: C:\build\night\LABEL\windows10\SPEC\default\V\6-18\root\interpreter\llvm\src\tools\clang\include\clang/AST/Expr.h(4717,34): warning C4146: unary minus operator applied to unsigned type, result still unsigned [C:\build\night\LABEL\windows10\SPEC\default\V\6-18\build\core\dictgen\Dictgen.vcxproj]
v6-18-00-patches-x86-winxp-vc16-opt: C:\build\night\LABEL\windows10\SPEC\default\V\6-18\root\interpreter\llvm\src\include\llvm/ADT/StringExtras.h(100,3): warning C4146: unary minus operator applied to unsigned type, result still unsigned [C:\build\night\LABEL\windows10\SPEC\default\V\6-18\build\core\metacling\src\MetaCling.vcxproj]
v6-18-00-patches-x86-winxp-vc16-opt: C:\build\night\LABEL\windows10\SPEC\default\V\6-18\root\interpreter\llvm\src\include\llvm/Support/MathExtras.h(372,31): warning C4146: unary minus operator applied to unsigned type, result still unsigned [C:\build\night\LABEL\windows10\SPEC\default\V\6-18\build\core\dictgen\Dictgen.vcxproj]
v6-18-00-patches-x86-winxp-vc16-opt: C:\build\night\LABEL\windows10\SPEC\default\V\6-18\root\interpreter\llvm\src\include\llvm/Support/MathExtras.h(372,31): warning C4146: unary minus operator applied to unsigned type, result still unsigned [C:\build\night\LABEL\windows10\SPEC\default\V\6-18\build\core\metacling\src\MetaCling.vcxproj]
v6-18-00-patches-x86-winxp-vc16-opt: C:\build\night\LABEL\windows10\SPEC\default\V\6-18\root\interpreter\llvm\src\tools\clang\include\clang/AST/Expr.h(4717,34): warning C4146: unary minus operator applied to unsigned type, result still unsigned [C:\build\night\LABEL\windows10\SPEC\default\V\6-18\build\core\metacling\src\MetaCling.vcxproj]
v6-18-00-patches-x86-winxp-vc16-opt: C:\build\night\LABEL\windows10\SPEC\default\V\6-18\root\interpreter\llvm\src\include\llvm/ADT/StringExtras.h(59,13): warning C4146: unary minus operator applied to unsigned type, result still unsigned [C:\build\night\LABEL\windows10\SPEC\default\V\6-18\build\core\metacling\src\MetaCling.vcxproj]
v6-18-00-patches-x86-winxp-vc16-opt: C:\build\night\LABEL\windows10\SPEC\default\V\6-18\root\interpreter\llvm\src\tools\clang\include\clang/AST/Expr.h(4717,34): warning C4146: unary minus operator applied to unsigned type, result still unsigned [C:\build\night\LABEL\windows10\SPEC\default\V\6-18\build\core\dictgen\Dictgen.vcxproj]
v6-18-00-patches-x86-winxp-vc16-opt: C:\build\night\LABEL\windows10\SPEC\default\V\6-18\root\interpreter\llvm\src\include\llvm/ADT/StringExtras.h(100,3): warning C4146: unary minus operator applied to unsigned type, result still unsigned [C:\build\night\LABEL\windows10\SPEC\default\V\6-18\build\core\metacling\src\MetaCling.vcxproj]
v6-18-00-patches-x86-winxp-vc16-opt: C:\build\night\LABEL\windows10\SPEC\default\V\6-18\root\interpreter\llvm\src\include\llvm/Support/MathExtras.h(372,31): warning C4146: unary minus operator applied to unsigned type, result still unsigned [C:\build\night\LABEL\windows10\SPEC\default\V\6-18\build\core\dictgen\Dictgen.vcxproj]
v6-18-00-patches-x86-winxp-vc16-opt: C:\build\night\LABEL\windows10\SPEC\default\V\6-18\root\interpreter\llvm\src\include\llvm/Support/MathExtras.h(372,31): warning C4146: unary minus operator applied to unsigned type, result still unsigned [C:\build\night\LABEL\windows10\SPEC\default\V\6-18\build\core\metacling\src\MetaCling.vcxproj]
v6-18-00-patches-x86-winxp-vc16-opt: C:\build\night\LABEL\windows10\SPEC\default\V\6-18\root\interpreter\llvm\src\include\llvm/Support/MathExtras.h(372,31): warning C4146: unary minus operator applied to unsigned type, result still unsigned [C:\build\night\LABEL\windows10\SPEC\default\V\6-18\build\core\dictgen\Dictgen.vcxproj]
v6-18-00-patches-x86-winxp-vc16-opt: C:\build\night\LABEL\windows10\SPEC\default\V\6-18\root\interpreter\llvm\src\tools\clang\include\clang/AST/Expr.h(4717,34): warning C4146: unary minus operator applied to unsigned type, result still unsigned [C:\build\night\LABEL\windows10\SPEC\default\V\6-18\build\core\metacling\src\MetaCling.vcxproj]
v6-18-00-patches-x86-winxp-vc16-opt: C:\build\night\LABEL\windows10\SPEC\default\V\6-18\root\interpreter\llvm\src\include\llvm/Support/MathExtras.h(372,31): warning C4146: unary minus operator applied to unsigned type, result still unsigned [C:\build\night\LABEL\windows10\SPEC\default\V\6-18\build\core\metacling\src\MetaCling.vcxproj]
v6-18-00-patches-x86-winxp-vc16-opt: C:\build\night\LABEL\windows10\SPEC\default\V\6-18\root\interpreter\llvm\src\tools\clang\include\clang/AST/Expr.h(4717,34): warning C4146: unary minus operator applied to unsigned type, result still unsigned [C:\build\night\LABEL\windows10\SPEC\default\V\6-18\build\core\dictgen\Dictgen.vcxproj]
v6-18-00-patches-x86-winxp-vc16-opt: C:\build\night\LABEL\windows10\SPEC\default\V\6-18\root\interpreter\llvm\src\tools\clang\include\clang/AST/Expr.h(4717,34): warning C4146: unary minus operator applied to unsigned type, result still unsigned [C:\build\night\LABEL\windows10\SPEC\default\V\6-18\build\core\metacling\src\MetaCling.vcxproj]
v6-18-00-patches-x86-winxp-vc16-opt: C:\build\night\LABEL\windows10\SPEC\default\V\6-18\root\interpreter\llvm\src\include\llvm/ADT/StringExtras.h(59,13): warning C4146: unary minus operator applied to unsigned type, result still unsigned [C:\build\night\LABEL\windows10\SPEC\default\V\6-18\build\core\metacling\src\MetaCling.vcxproj]
v6-18-00-patches-x86-winxp-vc16-opt: C:\build\night\LABEL\windows10\SPEC\default\V\6-18\root\interpreter\llvm\src\include\llvm/Support/MathExtras.h(372,31): warning C4146: unary minus operator applied to unsigned type, result still unsigned [C:\build\night\LABEL\windows10\SPEC\default\V\6-18\build\core\dictgen\Dictgen.vcxproj]
v6-18-00-patches-x86-winxp-vc16-opt: C:\build\night\LABEL\windows10\SPEC\default\V\6-18\root\interpreter\llvm\src\include\llvm/ADT/StringExtras.h(100,3): warning C4146: unary minus operator applied to unsigned type, result still unsigned [C:\build\night\LABEL\windows10\SPEC\default\V\6-18\build\core\metacling\src\MetaCling.vcxproj]
master-x86-winxp-vc16: C:\build\night\LABEL\windows10\SPEC\default\V\master\root\interpreter\llvm\src\lib\MC\MCMachOStreamer.cpp(111,1): warning C4266: 'void llvm::MCObjectStreamer::EmitLabel(llvm::MCSymbol *,llvm::SMLoc,llvm::MCFragment *)': no override available for virtual member function from base 'llvm::MCObjectStreamer'; function is hidden [C:\build\night\LABEL\windows10\SPEC\default\V\master\build\interpreter\llvm\src\lib\MC\LLVMMC.vcxproj]
master-x86-winxp-vc16: C:\build\night\LABEL\windows10\SPEC\default\V\master\root\interpreter\llvm\src\include\llvm/DebugInfo/CodeView/SymbolRecordMapping.h(43,1): warning C4266: 'llvm::Error llvm::codeview::SymbolVisitorCallbacks::visitSymbolBegin(llvm::codeview::CVSymbol &,uint32_t)': no override available for virtual member function from base 'llvm::codeview::SymbolVisitorCallbacks'; function is hidden (compiling source file C:\build\night\LABEL\windows10\SPEC\default\V\master\root\interpreter\llvm\src\lib\DebugInfo\CodeView\SymbolSerializer.cpp) [C:\build\night\LABEL\windows10\SPEC\default\V\master\build\interpreter\llvm\src\lib\DebugInfo\CodeView\LLVMDebugInfoCodeView.vcxproj]
master-x86-winxp-vc16: C:\build\night\LABEL\windows10\SPEC\default\V\master\root\interpreter\llvm\src\include\llvm/DebugInfo/CodeView/SymbolRecordMapping.h(43,1): warning C4266: 'llvm::Error llvm::codeview::SymbolVisitorCallbacks::visitSymbolBegin(llvm::codeview::CVSymbol &,uint32_t)': no override available for virtual member function from base 'llvm::codeview::SymbolVisitorCallbacks'; function is hidden (compiling source file C:\build\night\LABEL\windows10\SPEC\default\V\master\root\interpreter\llvm\src\lib\DebugInfo\CodeView\SymbolRecordMapping.cpp) [C:\build\night\LABEL\windows10\SPEC\default\V\master\build\interpreter\llvm\src\lib\DebugInfo\CodeView\LLVMDebugInfoCodeView.vcxproj]
master-x86-winxp-vc16: C:\build\night\LABEL\windows10\SPEC\default\V\master\root\interpreter\llvm\src\include\llvm/DebugInfo/CodeView/SymbolSerializer.h(76,1): warning C4266: 'llvm::Error llvm::codeview::SymbolVisitorCallbacks::visitSymbolBegin(llvm::codeview::CVSymbol &,uint32_t)': no override available for virtual member function from base 'llvm::codeview::SymbolVisitorCallbacks'; function is hidden (compiling source file C:\build\night\LABEL\windows10\SPEC\default\V\master\root\interpreter\llvm\src\lib\DebugInfo\CodeView\SymbolSerializer.cpp) [C:\build\night\LABEL\windows10\SPEC\default\V\master\build\interpreter\llvm\src\lib\DebugInfo\CodeView\LLVMDebugInfoCodeView.vcxproj]
master-x86-winxp-vc16: C:\build\night\LABEL\windows10\SPEC\default\V\master\root\interpreter\llvm\src\include\llvm/DebugInfo/CodeView/SymbolRecordMapping.h(43,1): warning C4266: 'llvm::Error llvm::codeview::SymbolVisitorCallbacks::visitSymbolBegin(llvm::codeview::CVSymbol &,uint32_t)': no override available for virtual member function from base 'llvm::codeview::SymbolVisitorCallbacks'; function is hidden (compiling source file C:\build\night\LABEL\windows10\SPEC\default\V\master\root\interpreter\llvm\src\lib\DebugInfo\CodeView\SymbolDumper.cpp) [C:\build\night\LABEL\windows10\SPEC\default\V\master\build\interpreter\llvm\src\lib\DebugInfo\CodeView\LLVMDebugInfoCodeView.vcxproj]
master-x86-winxp-vc16: C:\build\night\LABEL\windows10\SPEC\default\V\master\root\interpreter\llvm\src\lib\DebugInfo\CodeView\SymbolDumper.cpp(62,1): warning C4266: 'llvm::Error llvm::codeview::SymbolVisitorCallbacks::visitSymbolBegin(llvm::codeview::CVSymbol &,uint32_t)': no override available for virtual member function from base 'llvm::codeview::SymbolVisitorCallbacks'; function is hidden [C:\build\night\LABEL\windows10\SPEC\default\V\master\build\interpreter\llvm\src\lib\DebugInfo\CodeView\LLVMDebugInfoCodeView.vcxproj]
master-x86-winxp-vc16: C:\build\night\LABEL\windows10\SPEC\default\V\master\root\interpreter\llvm\src\include\llvm/MC/MCWinCOFFStreamer.h(76,1): warning C4266: 'void llvm::MCObjectStreamer::EmitLabel(llvm::MCSymbol *,llvm::SMLoc,llvm::MCFragment *)': no override available for virtual member function from base 'llvm::MCObjectStreamer'; function is hidden (compiling source file C:\build\night\LABEL\windows10\SPEC\default\V\master\root\interpreter\llvm\src\lib\MC\MCWinCOFFStreamer.cpp) [C:\build\night\LABEL\windows10\SPEC\default\V\master\build\interpreter\llvm\src\lib\MC\LLVMMC.vcxproj]
master-x86-winxp-vc16: C:\build\night\LABEL\windows10\SPEC\default\V\master\root\interpreter\llvm\src\lib\MC\WinCOFFObjectWriter.cpp(207,1): warning C4266: 'bool llvm::MCObjectWriter::isSymbolRefDifferenceFullyResolvedImpl(const llvm::MCAssembler &,const llvm::MCSymbol &,const llvm::MCSymbol &,bool) const': no override available for virtual member function from base 'llvm::MCObjectWriter'; function is hidden [C:\build\night\LABEL\windows10\SPEC\default\V\master\build\interpreter\llvm\src\lib\MC\LLVMMC.vcxproj]
master-x86-winxp-vc16: C:\build\night\LABEL\windows10\SPEC\default\V\master\root\interpreter\llvm\src\include\llvm/Transforms/IPO/Inliner.h(78,1): warning C4266: 'bool llvm::Pass::doInitialization(llvm::Module &)': no override available for virtual member function from base 'llvm::Pass'; function is hidden (compiling source file C:\build\night\LABEL\windows10\SPEC\default\V\master\root\interpreter\llvm\src\lib\Transforms\IPO\AlwaysInliner.cpp) [C:\build\night\LABEL\windows10\SPEC\default\V\master\build\interpreter\llvm\src\lib\Transforms\IPO\LLVMipo.vcxproj]
master-x86-winxp-vc16: C:\build\night\LABEL\windows10\SPEC\default\V\master\root\interpreter\llvm\src\include\llvm/Transforms/IPO/Inliner.h(78,1): warning C4266: 'bool llvm::Pass::doInitialization(llvm::Module &)': no override available for virtual member function from base 'llvm::Pass'; function is hidden (compiling source file C:\build\night\LABEL\windows10\SPEC\default\V\master\root\interpreter\llvm\src\lib\Transforms\IPO\Inliner.cpp) [C:\build\night\LABEL\windows10\SPEC\default\V\master\build\interpreter\llvm\src\lib\Transforms\IPO\LLVMipo.vcxproj]
master-x86-winxp-vc16: C:\build\night\LABEL\windows10\SPEC\default\V\master\root\interpreter\llvm\src\include\llvm/Transforms/IPO/Inliner.h(78,1): warning C4266: 'bool llvm::Pass::doInitialization(llvm::Module &)': no override available for virtual member function from base 'llvm::Pass'; function is hidden (compiling source file C:\build\night\LABEL\windows10\SPEC\default\V\master\root\interpreter\llvm\src\lib\Transforms\IPO\InlineSimple.cpp) [C:\build\night\LABEL\windows10\SPEC\default\V\master\build\interpreter\llvm\src\lib\Transforms\IPO\LLVMipo.vcxproj]
master-x86-winxp-vc16: C:\build\night\LABEL\windows10\SPEC\default\V\master\root\interpreter\llvm\src\lib\Transforms\Scalar\StructurizeCFG.cpp(243,1): warning C4266: 'bool llvm::Pass::doInitialization(llvm::Module &)': no override available for virtual member function from base 'llvm::Pass'; function is hidden [C:\build\night\LABEL\windows10\SPEC\default\V\master\build\interpreter\llvm\src\lib\Transforms\Scalar\LLVMScalarOpts.vcxproj]
master-x86-winxp-vc16: C:\build\night\LABEL\windows10\SPEC\default\V\master\root\interpreter\llvm\src\lib\Transforms\Coroutines\CoroSplit.cpp(733,1): warning C4266: 'bool llvm::Pass::doInitialization(llvm::Module &)': no override available for virtual member function from base 'llvm::Pass'; function is hidden [C:\build\night\LABEL\windows10\SPEC\default\V\master\build\interpreter\llvm\src\lib\Transforms\Coroutines\LLVMCoroutines.vcxproj]
master-x86-winxp-vc16: C:\build\night\LABEL\windows10\SPEC\default\V\master\root\interpreter\llvm\src\lib\Target\NVPTX\NVPTXISelLowering.h(576,1): warning C4266: 'bool llvm::TargetLoweringBase::isTruncateFree(llvm::EVT,llvm::EVT) const': no override available for virtual member function from base 'llvm::TargetLoweringBase'; function is hidden (compiling source file C:\build\night\LABEL\windows10\SPEC\default\V\master\root\interpreter\llvm\src\lib\Target\NVPTX\NVPTXAsmPrinter.cpp) [C:\build\night\LABEL\windows10\SPEC\default\V\master\build\interpreter\llvm\src\lib\Target\NVPTX\LLVMNVPTXCodeGen.vcxproj]
master-x86-winxp-vc16: C:\build\night\LABEL\windows10\SPEC\default\V\master\root\interpreter\llvm\src\lib\Target\NVPTX\NVPTXISelLowering.h(576,1): warning C4266: 'bool llvm::TargetLoweringBase::isTruncateFree(llvm::EVT,llvm::EVT) const': no override available for virtual member function from base 'llvm::TargetLoweringBase'; function is hidden (compiling source file C:\build\night\LABEL\windows10\SPEC\default\V\master\root\interpreter\llvm\src\lib\Target\NVPTX\NVPTXLowerArgs.cpp) [C:\build\night\LABEL\windows10\SPEC\default\V\master\build\interpreter\llvm\src\lib\Target\NVPTX\LLVMNVPTXCodeGen.vcxproj]
master-x86-winxp-vc16: C:\build\night\LABEL\windows10\SPEC\default\V\master\root\interpreter\llvm\src\lib\Target\NVPTX\NVPTXISelLowering.h(576,1): warning C4266: 'bool llvm::TargetLoweringBase::isTruncateFree(llvm::EVT,llvm::EVT) const': no override available for virtual member function from base 'llvm::TargetLoweringBase'; function is hidden (compiling source file C:\build\night\LABEL\windows10\SPEC\default\V\master\root\interpreter\llvm\src\lib\Target\NVPTX\NVPTXFrameLowering.cpp) [C:\build\night\LABEL\windows10\SPEC\default\V\master\build\interpreter\llvm\src\lib\Target\NVPTX\LLVMNVPTXCodeGen.vcxproj]
master-x86-winxp-vc16: C:\build\night\LABEL\windows10\SPEC\default\V\master\root\interpreter\llvm\src\lib\Target\NVPTX\NVPTXISelLowering.h(576,1): warning C4266: 'bool llvm::TargetLoweringBase::isTruncateFree(llvm::EVT,llvm::EVT) const': no override available for virtual member function from base 'llvm::TargetLoweringBase'; function is hidden (compiling source file C:\build\night\LABEL\windows10\SPEC\default\V\master\root\interpreter\llvm\src\lib\Target\NVPTX\NVPTXISelLowering.cpp) [C:\build\night\LABEL\windows10\SPEC\default\V\master\build\interpreter\llvm\src\lib\Target\NVPTX\LLVMNVPTXCodeGen.vcxproj]
master-x86-winxp-vc16: C:\build\night\LABEL\windows10\SPEC\default\V\master\root\interpreter\llvm\src\lib\Target\NVPTX\NVPTXISelLowering.h(576,1): warning C4266: 'bool llvm::TargetLoweringBase::isTruncateFree(llvm::EVT,llvm::EVT) const': no override available for virtual member function from base 'llvm::TargetLoweringBase'; function is hidden (compiling source file C:\build\night\LABEL\windows10\SPEC\default\V\master\root\interpreter\llvm\src\lib\Target\NVPTX\NVPTXRegisterInfo.cpp) [C:\build\night\LABEL\windows10\SPEC\default\V\master\build\interpreter\llvm\src\lib\Target\NVPTX\LLVMNVPTXCodeGen.vcxproj]
master-x86-winxp-vc16: C:\build\night\LABEL\windows10\SPEC\default\V\master\root\interpreter\llvm\src\lib\Target\NVPTX\NVPTXISelLowering.h(576,1): warning C4266: 'bool llvm::TargetLoweringBase::isTruncateFree(llvm::EVT,llvm::EVT) const': no override available for virtual member function from base 'llvm::TargetLoweringBase'; function is hidden (compiling source file C:\build\night\LABEL\windows10\SPEC\default\V\master\root\interpreter\llvm\src\lib\Target\NVPTX\NVPTXISelDAGToDAG.cpp) [C:\build\night\LABEL\windows10\SPEC\default\V\master\build\interpreter\llvm\src\lib\Target\NVPTX\LLVMNVPTXCodeGen.vcxproj]
master-x86-winxp-vc16: C:\build\night\LABEL\windows10\SPEC\default\V\master\root\interpreter\llvm\src\lib\Target\NVPTX\NVPTXISelLowering.h(576,1): warning C4266: 'bool llvm::TargetLoweringBase::isTruncateFree(llvm::EVT,llvm::EVT) const': no override available for virtual member function from base 'llvm::TargetLoweringBase'; function is hidden (compiling source file C:\build\night\LABEL\windows10\SPEC\default\V\master\root\interpreter\llvm\src\lib\Target\NVPTX\NVPTXInstrInfo.cpp) [C:\build\night\LABEL\windows10\SPEC\default\V\master\build\interpreter\llvm\src\lib\Target\NVPTX\LLVMNVPTXCodeGen.vcxproj]
master-x86-winxp-vc16: C:\build\night\LABEL\windows10\SPEC\default\V\master\root\interpreter\llvm\src\lib\Target\NVPTX\NVPTXISelLowering.h(576,1): warning C4266: 'bool llvm::TargetLoweringBase::isTruncateFree(llvm::EVT,llvm::EVT) const': no override available for virtual member function from base 'llvm::TargetLoweringBase'; function is hidden (compiling source file C:\build\night\LABEL\windows10\SPEC\default\V\master\root\interpreter\llvm\src\lib\Target\NVPTX\NVPTXTargetTransformInfo.cpp) [C:\build\night\LABEL\windows10\SPEC\default\V\master\build\interpreter\llvm\src\lib\Target\NVPTX\LLVMNVPTXCodeGen.vcxproj]
master-x86-winxp-vc16: C:\build\night\LABEL\windows10\SPEC\default\V\master\root\interpreter\llvm\src\lib\Target\NVPTX\NVPTXISelLowering.h(576,1): warning C4266: 'bool llvm::TargetLoweringBase::isTruncateFree(llvm::EVT,llvm::EVT) const': no override available for virtual member function from base 'llvm::TargetLoweringBase'; function is hidden (compiling source file C:\build\night\LABEL\windows10\SPEC\default\V\master\root\interpreter\llvm\src\lib\Target\NVPTX\NVPTXSubtarget.cpp) [C:\build\night\LABEL\windows10\SPEC\default\V\master\build\interpreter\llvm\src\lib\Target\NVPTX\LLVMNVPTXCodeGen.vcxproj]
master-x86-winxp-vc16: C:\build\night\LABEL\windows10\SPEC\default\V\master\root\interpreter\llvm\src\lib\Target\NVPTX\NVPTXISelLowering.h(576,1): warning C4266: 'bool llvm::TargetLoweringBase::isTruncateFree(llvm::EVT,llvm::EVT) const': no override available for virtual member function from base 'llvm::TargetLoweringBase'; function is hidden (compiling source file C:\build\night\LABEL\windows10\SPEC\default\V\master\root\interpreter\llvm\src\lib\Target\NVPTX\NVPTXReplaceImageHandles.cpp) [C:\build\night\LABEL\windows10\SPEC\default\V\master\build\interpreter\llvm\src\lib\Target\NVPTX\LLVMNVPTXCodeGen.vcxproj]
master-x86-winxp-vc16: C:\build\night\LABEL\windows10\SPEC\default\V\master\root\interpreter\llvm\src\lib\Target\NVPTX\NVPTXISelLowering.h(576,1): warning C4266: 'bool llvm::TargetLoweringBase::isTruncateFree(llvm::EVT,llvm::EVT) const': no override available for virtual member function from base 'llvm::TargetLoweringBase'; function is hidden (compiling source file C:\build\night\LABEL\windows10\SPEC\default\V\master\root\interpreter\llvm\src\lib\Target\NVPTX\NVPTXTargetMachine.cpp) [C:\build\night\LABEL\windows10\SPEC\default\V\master\build\interpreter\llvm\src\lib\Target\NVPTX\LLVMNVPTXCodeGen.vcxproj]
master-x86-winxp-vc16: C:\build\night\LABEL\windows10\SPEC\default\V\master\root\interpreter\llvm\src\include\llvm/CodeGen/ScoreboardHazardRecognizer.h(124,1): warning C4266: 'void llvm::ScheduleHazardRecognizer::EmitInstruction(llvm::MachineInstr *)': no override available for virtual member function from base 'llvm::ScheduleHazardRecognizer'; function is hidden (compiling source file C:\build\night\LABEL\windows10\SPEC\default\V\master\root\interpreter\llvm\src\lib\CodeGen\ScoreboardHazardRecognizer.cpp) [C:\build\night\LABEL\windows10\SPEC\default\V\master\build\interpreter\llvm\src\lib\CodeGen\LLVMCodeGen.vcxproj]
master-x86-winxp-vc16: C:\build\night\LABEL\windows10\SPEC\default\V\master\root\interpreter\llvm\src\include\llvm/CodeGen/ScoreboardHazardRecognizer.h(124,1): warning C4266: 'void llvm::ScheduleHazardRecognizer::EmitInstruction(llvm::MachineInstr *)': no override available for virtual member function from base 'llvm::ScheduleHazardRecognizer'; function is hidden (compiling source file C:\build\night\LABEL\windows10\SPEC\default\V\master\root\interpreter\llvm\src\lib\CodeGen\TargetInstrInfo.cpp) [C:\build\night\LABEL\windows10\SPEC\default\V\master\build\interpreter\llvm\src\lib\CodeGen\LLVMCodeGen.vcxproj]
master-x86-winxp-vc16: C:\build\night\LABEL\windows10\SPEC\default\V\master\root\interpreter\llvm\src\lib\Target\X86\AsmParser\X86AsmParser.cpp(878,1): warning C4266: 'bool llvm::MCTargetAsmParser::ParseInstruction(llvm::ParseInstructionInfo &,llvm::StringRef,llvm::AsmToken,llvm::OperandVector &)': no override available for virtual member function from base 'llvm::MCTargetAsmParser'; function is hidden [C:\build\night\LABEL\windows10\SPEC\default\V\master\build\interpreter\llvm\src\lib\Target\X86\AsmParser\LLVMX86AsmParser.vcxproj]
master-x86-winxp-vc16: C:\build\night\LABEL\windows10\SPEC\default\V\master\root\interpreter\llvm\src\include\llvm/MC/MCWinCOFFStreamer.h(76,1): warning C4266: 'void llvm::MCObjectStreamer::EmitLabel(llvm::MCSymbol *,llvm::SMLoc,llvm::MCFragment *)': no override available for virtual member function from base 'llvm::MCObjectStreamer'; function is hidden (compiling source file C:\build\night\LABEL\windows10\SPEC\default\V\master\root\interpreter\llvm\src\lib\Target\X86\MCTargetDesc\X86WinCOFFStreamer.cpp) [C:\build\night\LABEL\windows10\SPEC\default\V\master\build\interpreter\llvm\src\lib\Target\X86\MCTargetDesc\LLVMX86Desc.vcxproj]
master-x86-winxp-vc16: C:\build\night\LABEL\windows10\SPEC\default\V\master\root\interpreter\llvm\src\include\llvm/Transforms/IPO/Inliner.h(78,1): warning C4266: 'bool llvm::Pass::doInitialization(llvm::Module &)': no override available for virtual member function from base 'llvm::Pass'; function is hidden [C:\build\night\LABEL\windows10\SPEC\default\V\master\build\interpreter\llvm\src\lib\Passes\LLVMPasses.vcxproj]
master-x86-winxp-vc16: C:\Program Files (x86)\Windows Kits\10\Include\10.0.17763.0\ucrt\ctype.h(183,110): warning C4090: 'function': different 'const' qualifiers [C:\build\night\LABEL\windows10\SPEC\default\V\master\build\build\rmkdepend.vcxproj]
master-x86-winxp-vc16: C:\Program Files (x86)\Windows Kits\10\Include\10.0.17763.0\ucrt\corecrt_wstdlib.h(377,10): warning C4028: formal parameter 1 different from declaration [C:\build\night\LABEL\windows10\SPEC\default\V\master\build\build\rmkdepend.vcxproj]
master-x86-winxp-vc16: C:\Program Files (x86)\Windows Kits\10\Include\10.0.17763.0\ucrt\stdlib.h(232,65): warning C4028: formal parameter 1 different from declaration [C:\build\night\LABEL\windows10\SPEC\default\V\master\build\build\rmkdepend.vcxproj]
master-x86-winxp-vc16: C:\build\night\LABEL\windows10\SPEC\default\V\master\root\interpreter\llvm\src\include\llvm/Transforms/IPO/Inliner.h(78,1): warning C4266: 'bool llvm::Pass::doInitialization(llvm::Module &)': no override available for virtual member function from base 'llvm::Pass'; function is hidden (compiling source file C:\build\night\LABEL\windows10\SPEC\default\V\master\root\interpreter\cling\lib\Interpreter\BackendPasses.cpp) [C:\build\night\LABEL\windows10\SPEC\default\V\master\build\interpreter\llvm\src\tools\cling\lib\Interpreter\obj.clingInterpreter.vcxproj]
master-x86-winxp-vc16: C:\build\night\LABEL\windows10\SPEC\default\V\master\root\interpreter\llvm\src\include\llvm/Support/MathExtras.h(372,31): warning C4146: unary minus operator applied to unsigned type, result still unsigned [C:\build\night\LABEL\windows10\SPEC\default\V\master\build\core\dictgen\Dictgen.vcxproj]
master-x86-winxp-vc16: C:\build\night\LABEL\windows10\SPEC\default\V\master\root\interpreter\llvm\src\include\llvm/Support/MathExtras.h(372,31): warning C4146: unary minus operator applied to unsigned type, result still unsigned [C:\build\night\LABEL\windows10\SPEC\default\V\master\build\core\metacling\src\MetaCling.vcxproj]
master-x86-winxp-vc16: C:\build\night\LABEL\windows10\SPEC\default\V\master\root\interpreter\llvm\src\include\llvm/Support/MathExtras.h(372,31): warning C4146: unary minus operator applied to unsigned type, result still unsigned [C:\build\night\LABEL\windows10\SPEC\default\V\master\build\core\clingutils\ClingUtils.vcxproj]
master-x86-winxp-vc16: C:\build\night\LABEL\windows10\SPEC\default\V\master\root\interpreter\llvm\src\tools\clang\include\clang/AST/Expr.h(4717,34): warning C4146: unary minus operator applied to unsigned type, result still unsigned [C:\build\night\LABEL\windows10\SPEC\default\V\master\build\core\metacling\src\MetaCling.vcxproj]
master-x86-winxp-vc16: C:\build\night\LABEL\windows10\SPEC\default\V\master\root\interpreter\llvm\src\include\llvm/ADT/StringExtras.h(59,13): warning C4146: unary minus operator applied to unsigned type, result still unsigned [C:\build\night\LABEL\windows10\SPEC\default\V\master\build\core\metacling\src\MetaCling.vcxproj]
master-x86-winxp-vc16: C:\build\night\LABEL\windows10\SPEC\default\V\master\root\interpreter\llvm\src\tools\clang\include\clang/AST/Expr.h(4717,34): warning C4146: unary minus operator applied to unsigned type, result still unsigned [C:\build\night\LABEL\windows10\SPEC\default\V\master\build\core\dictgen\Dictgen.vcxproj]
master-x86-winxp-vc16: C:\build\night\LABEL\windows10\SPEC\default\V\master\root\interpreter\llvm\src\include\llvm/Support/MathExtras.h(372,31): warning C4146: unary minus operator applied to unsigned type, result still unsigned [C:\build\night\LABEL\windows10\SPEC\default\V\master\build\core\dictgen\Dictgen.vcxproj]
master-x86-winxp-vc16: C:\build\night\LABEL\windows10\SPEC\default\V\master\root\interpreter\llvm\src\include\llvm/ADT/StringExtras.h(100,3): warning C4146: unary minus operator applied to unsigned type, result still unsigned [C:\build\night\LABEL\windows10\SPEC\default\V\master\build\core\metacling\src\MetaCling.vcxproj]
master-x86-winxp-vc16: C:\build\night\LABEL\windows10\SPEC\default\V\master\root\interpreter\llvm\src\tools\clang\include\clang/AST/Expr.h(4717,34): warning C4146: unary minus operator applied to unsigned type, result still unsigned [C:\build\night\LABEL\windows10\SPEC\default\V\master\build\core\clingutils\ClingUtils.vcxproj]
master-x86-winxp-vc16: C:\build\night\LABEL\windows10\SPEC\default\V\master\root\interpreter\llvm\src\include\llvm/Support/MathExtras.h(372,31): warning C4146: unary minus operator applied to unsigned type, result still unsigned [C:\build\night\LABEL\windows10\SPEC\default\V\master\build\core\metacling\src\MetaCling.vcxproj]
master-x86-winxp-vc16: C:\build\night\LABEL\windows10\SPEC\default\V\master\root\interpreter\llvm\src\include\llvm/Support/MathExtras.h(372,31): warning C4146: unary minus operator applied to unsigned type, result still unsigned [C:\build\night\LABEL\windows10\SPEC\default\V\master\build\core\clingutils\ClingUtils.vcxproj]
master-x86-winxp-vc16: C:\build\night\LABEL\windows10\SPEC\default\V\master\root\interpreter\llvm\src\tools\clang\include\clang/AST/Expr.h(4717,34): warning C4146: unary minus operator applied to unsigned type, result still unsigned [C:\build\night\LABEL\windows10\SPEC\default\V\master\build\core\metacling\src\MetaCling.vcxproj]
master-x86-winxp-vc16: C:\build\night\LABEL\windows10\SPEC\default\V\master\root\interpreter\llvm\src\include\llvm/ADT/StringExtras.h(59,13): warning C4146: unary minus operator applied to unsigned type, result still unsigned [C:\build\night\LABEL\windows10\SPEC\default\V\master\build\core\metacling\src\MetaCling.vcxproj]
master-x86-winxp-vc16: C:\build\night\LABEL\windows10\SPEC\default\V\master\root\interpreter\llvm\src\tools\clang\include\clang/AST/Expr.h(4717,34): warning C4146: unary minus operator applied to unsigned type, result still unsigned [C:\build\night\LABEL\windows10\SPEC\default\V\master\build\core\dictgen\Dictgen.vcxproj]
master-x86-winxp-vc16: C:\build\night\LABEL\windows10\SPEC\default\V\master\root\interpreter\llvm\src\include\llvm/ADT/StringExtras.h(100,3): warning C4146: unary minus operator applied to unsigned type, result still unsigned [C:\build\night\LABEL\windows10\SPEC\default\V\master\build\core\metacling\src\MetaCling.vcxproj]

/cvmfs/sft.cern.ch/lcg/contrib/llvm/builds/x86_64-centos7-gcc48-opt/clang_build_367044/lib/clang/10.0.0/include/ia32intrin.h

Warnings:

master-x86_64-centos7-clang100-opt-master: /cvmfs/sft.cern.ch/lcg/contrib/llvm/builds/x86_64-centos7-gcc48-opt/clang_build_367044/lib/clang/10.0.0/include/ia32intrin.h:72:9: note: previous definition is here
master-x86_64-centos7-clang100-opt-master: /cvmfs/sft.cern.ch/lcg/contrib/llvm/builds/x86_64-centos7-gcc48-opt/clang_build_367044/lib/clang/10.0.0/include/ia32intrin.h:72:9: note: previous definition is here
master-x86_64-centos7-clang100-opt-master: /cvmfs/sft.cern.ch/lcg/contrib/llvm/builds/x86_64-centos7-gcc48-opt/clang_build_367044/lib/clang/10.0.0/include/ia32intrin.h:72:9: note: previous definition is here
master-x86_64-centos7-clang100-opt-master: /cvmfs/sft.cern.ch/lcg/contrib/llvm/builds/x86_64-centos7-gcc48-opt/clang_build_367044/lib/clang/10.0.0/include/ia32intrin.h:72:9: note: previous definition is here
master-x86_64-centos7-clang100-opt-master: /cvmfs/sft.cern.ch/lcg/contrib/llvm/builds/x86_64-centos7-gcc48-opt/clang_build_367044/lib/clang/10.0.0/include/ia32intrin.h:72:9: note: previous definition is here
master-x86_64-centos7-clang100-opt-master: /cvmfs/sft.cern.ch/lcg/contrib/llvm/builds/x86_64-centos7-gcc48-opt/clang_build_367044/lib/clang/10.0.0/include/ia32intrin.h:72:9: note: previous definition is here
master-x86_64-centos7-clang100-opt-master: /cvmfs/sft.cern.ch/lcg/contrib/llvm/builds/x86_64-centos7-gcc48-opt/clang_build_367044/lib/clang/10.0.0/include/ia32intrin.h:72:9: note: previous definition is here
master-x86_64-centos7-clang100-opt-master: /cvmfs/sft.cern.ch/lcg/contrib/llvm/builds/x86_64-centos7-gcc48-opt/clang_build_367044/lib/clang/10.0.0/include/ia32intrin.h:72:9: note: previous definition is here
master-x86_64-centos7-clang100-opt-master: /cvmfs/sft.cern.ch/lcg/contrib/llvm/builds/x86_64-centos7-gcc48-opt/clang_build_367044/lib/clang/10.0.0/include/ia32intrin.h:72:9: note: previous definition is here
master-x86_64-centos7-clang100-opt-master: /cvmfs/sft.cern.ch/lcg/contrib/llvm/builds/x86_64-centos7-gcc48-opt/clang_build_367044/lib/clang/10.0.0/include/ia32intrin.h:72:9: note: previous definition is here
master-x86_64-centos7-clang100-opt-master: /cvmfs/sft.cern.ch/lcg/contrib/llvm/builds/x86_64-centos7-gcc48-opt/clang_build_367044/lib/clang/10.0.0/include/ia32intrin.h:72:9: note: previous definition is here
master-x86_64-centos7-clang100-opt-master: /cvmfs/sft.cern.ch/lcg/contrib/llvm/builds/x86_64-centos7-gcc48-opt/clang_build_367044/lib/clang/10.0.0/include/ia32intrin.h:72:9: note: previous definition is here
master-x86_64-centos7-clang100-opt-master: /cvmfs/sft.cern.ch/lcg/contrib/llvm/builds/x86_64-centos7-gcc48-opt/clang_build_367044/lib/clang/10.0.0/include/ia32intrin.h:72:9: note: previous definition is here
master-x86_64-centos7-clang100-opt-master: /cvmfs/sft.cern.ch/lcg/contrib/llvm/builds/x86_64-centos7-gcc48-opt/clang_build_367044/lib/clang/10.0.0/include/ia32intrin.h:72:9: note: previous definition is here
master-x86_64-centos7-clang100-opt-master: /cvmfs/sft.cern.ch/lcg/contrib/llvm/builds/x86_64-centos7-gcc48-opt/clang_build_367044/lib/clang/10.0.0/include/ia32intrin.h:72:9: note: previous definition is here
master-x86_64-centos7-clang100-opt-master: /cvmfs/sft.cern.ch/lcg/contrib/llvm/builds/x86_64-centos7-gcc48-opt/clang_build_367044/lib/clang/10.0.0/include/ia32intrin.h:72:9: note: previous definition is here
master-x86_64-centos7-clang100-opt-master: /cvmfs/sft.cern.ch/lcg/contrib/llvm/builds/x86_64-centos7-gcc48-opt/clang_build_367044/lib/clang/10.0.0/include/ia32intrin.h:72:9: note: previous definition is here
master-x86_64-centos7-clang100-opt-master: /cvmfs/sft.cern.ch/lcg/contrib/llvm/builds/x86_64-centos7-gcc48-opt/clang_build_367044/lib/clang/10.0.0/include/ia32intrin.h:72:9: note: previous definition is here
master-x86_64-centos7-clang100-opt-master: /cvmfs/sft.cern.ch/lcg/contrib/llvm/builds/x86_64-centos7-gcc48-opt/clang_build_367044/lib/clang/10.0.0/include/ia32intrin.h:72:9: note: previous definition is here
master-x86_64-centos7-clang100-opt-master: /cvmfs/sft.cern.ch/lcg/contrib/llvm/builds/x86_64-centos7-gcc48-opt/clang_build_367044/lib/clang/10.0.0/include/ia32intrin.h:72:9: note: previous definition is here
master-x86_64-centos7-clang100-opt-master: /cvmfs/sft.cern.ch/lcg/contrib/llvm/builds/x86_64-centos7-gcc48-opt/clang_build_367044/lib/clang/10.0.0/include/ia32intrin.h:72:9: note: previous definition is here
master-x86_64-centos7-clang100-opt-master: /cvmfs/sft.cern.ch/lcg/contrib/llvm/builds/x86_64-centos7-gcc48-opt/clang_build_367044/lib/clang/10.0.0/include/ia32intrin.h:72:9: note: previous definition is here
master-x86_64-centos7-clang100-opt-master: /cvmfs/sft.cern.ch/lcg/contrib/llvm/builds/x86_64-centos7-gcc48-opt/clang_build_367044/lib/clang/10.0.0/include/ia32intrin.h:72:9: note: previous definition is here
master-x86_64-centos7-clang100-opt-master: /cvmfs/sft.cern.ch/lcg/contrib/llvm/builds/x86_64-centos7-gcc48-opt/clang_build_367044/lib/clang/10.0.0/include/ia32intrin.h:72:9: note: previous definition is here
master-x86_64-centos7-clang100-opt-cxxmodules: /cvmfs/sft.cern.ch/lcg/contrib/llvm/builds/x86_64-centos7-gcc48-opt/clang_build_367044/lib/clang/10.0.0/include/ia32intrin.h:72:9: note: previous definition is here
master-x86_64-centos7-clang100-opt-cxxmodules: /cvmfs/sft.cern.ch/lcg/contrib/llvm/builds/x86_64-centos7-gcc48-opt/clang_build_367044/lib/clang/10.0.0/include/ia32intrin.h:72:9: note: previous definition is here
master-x86_64-centos7-clang100-opt-cxxmodules: /cvmfs/sft.cern.ch/lcg/contrib/llvm/builds/x86_64-centos7-gcc48-opt/clang_build_367044/lib/clang/10.0.0/include/ia32intrin.h:72:9: note: previous definition is here
master-x86_64-centos7-clang100-opt-cxxmodules: /cvmfs/sft.cern.ch/lcg/contrib/llvm/builds/x86_64-centos7-gcc48-opt/clang_build_367044/lib/clang/10.0.0/include/ia32intrin.h:72:9: note: previous definition is here
master-x86_64-centos7-clang100-opt-cxxmodules: /cvmfs/sft.cern.ch/lcg/contrib/llvm/builds/x86_64-centos7-gcc48-opt/clang_build_367044/lib/clang/10.0.0/include/ia32intrin.h:72:9: note: previous definition is here
master-x86_64-centos7-clang100-opt-cxxmodules: /cvmfs/sft.cern.ch/lcg/contrib/llvm/builds/x86_64-centos7-gcc48-opt/clang_build_367044/lib/clang/10.0.0/include/ia32intrin.h:72:9: note: previous definition is here
master-x86_64-centos7-clang100-opt-cxxmodules: /cvmfs/sft.cern.ch/lcg/contrib/llvm/builds/x86_64-centos7-gcc48-opt/clang_build_367044/lib/clang/10.0.0/include/ia32intrin.h:72:9: note: previous definition is here
master-x86_64-centos7-clang100-opt-cxxmodules: /cvmfs/sft.cern.ch/lcg/contrib/llvm/builds/x86_64-centos7-gcc48-opt/clang_build_367044/lib/clang/10.0.0/include/ia32intrin.h:72:9: note: previous definition is here
master-x86_64-centos7-clang100-opt-cxxmodules: /cvmfs/sft.cern.ch/lcg/contrib/llvm/builds/x86_64-centos7-gcc48-opt/clang_build_367044/lib/clang/10.0.0/include/ia32intrin.h:72:9: note: previous definition is here
master-x86_64-centos7-clang100-opt-cxxmodules: /cvmfs/sft.cern.ch/lcg/contrib/llvm/builds/x86_64-centos7-gcc48-opt/clang_build_367044/lib/clang/10.0.0/include/ia32intrin.h:72:9: note: previous definition is here
master-x86_64-centos7-clang100-opt-no-rt-cxxmodules: /cvmfs/sft.cern.ch/lcg/contrib/llvm/builds/x86_64-centos7-gcc48-opt/clang_build_367044/lib/clang/10.0.0/include/ia32intrin.h:72:9: note: previous definition is here
master-x86_64-centos7-clang100-opt-no-rt-cxxmodules: /cvmfs/sft.cern.ch/lcg/contrib/llvm/builds/x86_64-centos7-gcc48-opt/clang_build_367044/lib/clang/10.0.0/include/ia32intrin.h:72:9: note: previous definition is here
master-x86_64-centos7-clang100-opt-no-rt-cxxmodules: /cvmfs/sft.cern.ch/lcg/contrib/llvm/builds/x86_64-centos7-gcc48-opt/clang_build_367044/lib/clang/10.0.0/include/ia32intrin.h:72:9: note: previous definition is here
master-x86_64-centos7-clang100-opt-no-rt-cxxmodules: /cvmfs/sft.cern.ch/lcg/contrib/llvm/builds/x86_64-centos7-gcc48-opt/clang_build_367044/lib/clang/10.0.0/include/ia32intrin.h:72:9: note: previous definition is here
master-x86_64-centos7-clang100-opt-no-rt-cxxmodules: /cvmfs/sft.cern.ch/lcg/contrib/llvm/builds/x86_64-centos7-gcc48-opt/clang_build_367044/lib/clang/10.0.0/include/ia32intrin.h:72:9: note: previous definition is here
master-x86_64-centos7-clang100-opt-no-rt-cxxmodules: /cvmfs/sft.cern.ch/lcg/contrib/llvm/builds/x86_64-centos7-gcc48-opt/clang_build_367044/lib/clang/10.0.0/include/ia32intrin.h:72:9: note: previous definition is here
master-x86_64-centos7-clang100-opt-no-rt-cxxmodules: /cvmfs/sft.cern.ch/lcg/contrib/llvm/builds/x86_64-centos7-gcc48-opt/clang_build_367044/lib/clang/10.0.0/include/ia32intrin.h:72:9: note: previous definition is here
master-x86_64-centos7-clang100-opt-no-rt-cxxmodules: /cvmfs/sft.cern.ch/lcg/contrib/llvm/builds/x86_64-centos7-gcc48-opt/clang_build_367044/lib/clang/10.0.0/include/ia32intrin.h:72:9: note: previous definition is here
master-x86_64-centos7-clang100-opt-no-rt-cxxmodules: /cvmfs/sft.cern.ch/lcg/contrib/llvm/builds/x86_64-centos7-gcc48-opt/clang_build_367044/lib/clang/10.0.0/include/ia32intrin.h:72:9: note: previous definition is here
master-x86_64-centos7-clang100-opt-no-rt-cxxmodules: /cvmfs/sft.cern.ch/lcg/contrib/llvm/builds/x86_64-centos7-gcc48-opt/clang_build_367044/lib/clang/10.0.0/include/ia32intrin.h:72:9: note: previous definition is here
master-x86_64-centos7-clang100-opt-no-rt-cxxmodules: /cvmfs/sft.cern.ch/lcg/contrib/llvm/builds/x86_64-centos7-gcc48-opt/clang_build_367044/lib/clang/10.0.0/include/ia32intrin.h:72:9: note: previous definition is here
master-x86_64-centos7-clang100-opt-no-rt-cxxmodules: /cvmfs/sft.cern.ch/lcg/contrib/llvm/builds/x86_64-centos7-gcc48-opt/clang_build_367044/lib/clang/10.0.0/include/ia32intrin.h:72:9: note: previous definition is here
master-x86_64-centos7-clang100-opt-no-rt-cxxmodules: /cvmfs/sft.cern.ch/lcg/contrib/llvm/builds/x86_64-centos7-gcc48-opt/clang_build_367044/lib/clang/10.0.0/include/ia32intrin.h:72:9: note: previous definition is here
master-x86_64-centos7-clang100-opt-no-rt-cxxmodules: /cvmfs/sft.cern.ch/lcg/contrib/llvm/builds/x86_64-centos7-gcc48-opt/clang_build_367044/lib/clang/10.0.0/include/ia32intrin.h:72:9: note: previous definition is here
master-x86_64-centos7-clang100-opt-no-rt-cxxmodules: /cvmfs/sft.cern.ch/lcg/contrib/llvm/builds/x86_64-centos7-gcc48-opt/clang_build_367044/lib/clang/10.0.0/include/ia32intrin.h:72:9: note: previous definition is here
master-x86_64-centos7-clang100-opt-no-rt-cxxmodules: /cvmfs/sft.cern.ch/lcg/contrib/llvm/builds/x86_64-centos7-gcc48-opt/clang_build_367044/lib/clang/10.0.0/include/ia32intrin.h:72:9: note: previous definition is here
master-x86_64-centos7-clang100-opt-no-rt-cxxmodules: /cvmfs/sft.cern.ch/lcg/contrib/llvm/builds/x86_64-centos7-gcc48-opt/clang_build_367044/lib/clang/10.0.0/include/ia32intrin.h:72:9: note: previous definition is here
master-x86_64-centos7-clang100-opt-no-rt-cxxmodules: /cvmfs/sft.cern.ch/lcg/contrib/llvm/builds/x86_64-centos7-gcc48-opt/clang_build_367044/lib/clang/10.0.0/include/ia32intrin.h:72:9: note: previous definition is here
master-x86_64-centos7-clang100-opt-no-rt-cxxmodules: /cvmfs/sft.cern.ch/lcg/contrib/llvm/builds/x86_64-centos7-gcc48-opt/clang_build_367044/lib/clang/10.0.0/include/ia32intrin.h:72:9: note: previous definition is here
master-x86_64-centos7-clang100-opt-no-rt-cxxmodules: /cvmfs/sft.cern.ch/lcg/contrib/llvm/builds/x86_64-centos7-gcc48-opt/clang_build_367044/lib/clang/10.0.0/include/ia32intrin.h:72:9: note: previous definition is here
master-x86_64-centos7-clang100-opt-no-rt-cxxmodules: /cvmfs/sft.cern.ch/lcg/contrib/llvm/builds/x86_64-centos7-gcc48-opt/clang_build_367044/lib/clang/10.0.0/include/ia32intrin.h:72:9: note: previous definition is here
master-x86_64-centos7-clang100-opt-no-rt-cxxmodules: /cvmfs/sft.cern.ch/lcg/contrib/llvm/builds/x86_64-centos7-gcc48-opt/clang_build_367044/lib/clang/10.0.0/include/ia32intrin.h:72:9: note: previous definition is here
master-x86_64-centos7-clang100-opt-no-rt-cxxmodules: /cvmfs/sft.cern.ch/lcg/contrib/llvm/builds/x86_64-centos7-gcc48-opt/clang_build_367044/lib/clang/10.0.0/include/ia32intrin.h:72:9: note: previous definition is here
master-x86_64-centos7-clang100-opt-no-rt-cxxmodules: /cvmfs/sft.cern.ch/lcg/contrib/llvm/builds/x86_64-centos7-gcc48-opt/clang_build_367044/lib/clang/10.0.0/include/ia32intrin.h:72:9: note: previous definition is here
master-x86_64-centos7-clang100-opt-master: /cvmfs/sft.cern.ch/lcg/contrib/llvm/builds/x86_64-centos7-gcc48-opt/clang_build_367044/lib/clang/10.0.0/include/ia32intrin.h:73:9: note: previous definition is here
master-x86_64-centos7-clang100-opt-master: /cvmfs/sft.cern.ch/lcg/contrib/llvm/builds/x86_64-centos7-gcc48-opt/clang_build_367044/lib/clang/10.0.0/include/ia32intrin.h:73:9: note: previous definition is here
master-x86_64-centos7-clang100-opt-master: /cvmfs/sft.cern.ch/lcg/contrib/llvm/builds/x86_64-centos7-gcc48-opt/clang_build_367044/lib/clang/10.0.0/include/ia32intrin.h:73:9: note: previous definition is here
master-x86_64-centos7-clang100-opt-master: /cvmfs/sft.cern.ch/lcg/contrib/llvm/builds/x86_64-centos7-gcc48-opt/clang_build_367044/lib/clang/10.0.0/include/ia32intrin.h:73:9: note: previous definition is here
master-x86_64-centos7-clang100-opt-master: /cvmfs/sft.cern.ch/lcg/contrib/llvm/builds/x86_64-centos7-gcc48-opt/clang_build_367044/lib/clang/10.0.0/include/ia32intrin.h:73:9: note: previous definition is here
master-x86_64-centos7-clang100-opt-master: /cvmfs/sft.cern.ch/lcg/contrib/llvm/builds/x86_64-centos7-gcc48-opt/clang_build_367044/lib/clang/10.0.0/include/ia32intrin.h:73:9: note: previous definition is here
master-x86_64-centos7-clang100-opt-master: /cvmfs/sft.cern.ch/lcg/contrib/llvm/builds/x86_64-centos7-gcc48-opt/clang_build_367044/lib/clang/10.0.0/include/ia32intrin.h:73:9: note: previous definition is here
master-x86_64-centos7-clang100-opt-master: /cvmfs/sft.cern.ch/lcg/contrib/llvm/builds/x86_64-centos7-gcc48-opt/clang_build_367044/lib/clang/10.0.0/include/ia32intrin.h:73:9: note: previous definition is here
master-x86_64-centos7-clang100-opt-master: /cvmfs/sft.cern.ch/lcg/contrib/llvm/builds/x86_64-centos7-gcc48-opt/clang_build_367044/lib/clang/10.0.0/include/ia32intrin.h:73:9: note: previous definition is here
master-x86_64-centos7-clang100-opt-master: /cvmfs/sft.cern.ch/lcg/contrib/llvm/builds/x86_64-centos7-gcc48-opt/clang_build_367044/lib/clang/10.0.0/include/ia32intrin.h:73:9: note: previous definition is here
master-x86_64-centos7-clang100-opt-master: /cvmfs/sft.cern.ch/lcg/contrib/llvm/builds/x86_64-centos7-gcc48-opt/clang_build_367044/lib/clang/10.0.0/include/ia32intrin.h:73:9: note: previous definition is here
master-x86_64-centos7-clang100-opt-master: /cvmfs/sft.cern.ch/lcg/contrib/llvm/builds/x86_64-centos7-gcc48-opt/clang_build_367044/lib/clang/10.0.0/include/ia32intrin.h:73:9: note: previous definition is here
master-x86_64-centos7-clang100-opt-master: /cvmfs/sft.cern.ch/lcg/contrib/llvm/builds/x86_64-centos7-gcc48-opt/clang_build_367044/lib/clang/10.0.0/include/ia32intrin.h:73:9: note: previous definition is here
master-x86_64-centos7-clang100-opt-master: /cvmfs/sft.cern.ch/lcg/contrib/llvm/builds/x86_64-centos7-gcc48-opt/clang_build_367044/lib/clang/10.0.0/include/ia32intrin.h:73:9: note: previous definition is here
master-x86_64-centos7-clang100-opt-master: /cvmfs/sft.cern.ch/lcg/contrib/llvm/builds/x86_64-centos7-gcc48-opt/clang_build_367044/lib/clang/10.0.0/include/ia32intrin.h:73:9: note: previous definition is here
master-x86_64-centos7-clang100-opt-master: /cvmfs/sft.cern.ch/lcg/contrib/llvm/builds/x86_64-centos7-gcc48-opt/clang_build_367044/lib/clang/10.0.0/include/ia32intrin.h:73:9: note: previous definition is here
master-x86_64-centos7-clang100-opt-master: /cvmfs/sft.cern.ch/lcg/contrib/llvm/builds/x86_64-centos7-gcc48-opt/clang_build_367044/lib/clang/10.0.0/include/ia32intrin.h:73:9: note: previous definition is here
master-x86_64-centos7-clang100-opt-master: /cvmfs/sft.cern.ch/lcg/contrib/llvm/builds/x86_64-centos7-gcc48-opt/clang_build_367044/lib/clang/10.0.0/include/ia32intrin.h:73:9: note: previous definition is here
master-x86_64-centos7-clang100-opt-master: /cvmfs/sft.cern.ch/lcg/contrib/llvm/builds/x86_64-centos7-gcc48-opt/clang_build_367044/lib/clang/10.0.0/include/ia32intrin.h:73:9: note: previous definition is here
master-x86_64-centos7-clang100-opt-master: /cvmfs/sft.cern.ch/lcg/contrib/llvm/builds/x86_64-centos7-gcc48-opt/clang_build_367044/lib/clang/10.0.0/include/ia32intrin.h:73:9: note: previous definition is here
master-x86_64-centos7-clang100-opt-master: /cvmfs/sft.cern.ch/lcg/contrib/llvm/builds/x86_64-centos7-gcc48-opt/clang_build_367044/lib/clang/10.0.0/include/ia32intrin.h:73:9: note: previous definition is here
master-x86_64-centos7-clang100-opt-master: /cvmfs/sft.cern.ch/lcg/contrib/llvm/builds/x86_64-centos7-gcc48-opt/clang_build_367044/lib/clang/10.0.0/include/ia32intrin.h:73:9: note: previous definition is here
master-x86_64-centos7-clang100-opt-master: /cvmfs/sft.cern.ch/lcg/contrib/llvm/builds/x86_64-centos7-gcc48-opt/clang_build_367044/lib/clang/10.0.0/include/ia32intrin.h:73:9: note: previous definition is here
master-x86_64-centos7-clang100-opt-master: /cvmfs/sft.cern.ch/lcg/contrib/llvm/builds/x86_64-centos7-gcc48-opt/clang_build_367044/lib/clang/10.0.0/include/ia32intrin.h:73:9: note: previous definition is here
master-x86_64-centos7-clang100-opt-cxxmodules: /cvmfs/sft.cern.ch/lcg/contrib/llvm/builds/x86_64-centos7-gcc48-opt/clang_build_367044/lib/clang/10.0.0/include/ia32intrin.h:73:9: note: previous definition is here
master-x86_64-centos7-clang100-opt-cxxmodules: /cvmfs/sft.cern.ch/lcg/contrib/llvm/builds/x86_64-centos7-gcc48-opt/clang_build_367044/lib/clang/10.0.0/include/ia32intrin.h:73:9: note: previous definition is here
master-x86_64-centos7-clang100-opt-cxxmodules: /cvmfs/sft.cern.ch/lcg/contrib/llvm/builds/x86_64-centos7-gcc48-opt/clang_build_367044/lib/clang/10.0.0/include/ia32intrin.h:73:9: note: previous definition is here
master-x86_64-centos7-clang100-opt-cxxmodules: /cvmfs/sft.cern.ch/lcg/contrib/llvm/builds/x86_64-centos7-gcc48-opt/clang_build_367044/lib/clang/10.0.0/include/ia32intrin.h:73:9: note: previous definition is here
master-x86_64-centos7-clang100-opt-cxxmodules: /cvmfs/sft.cern.ch/lcg/contrib/llvm/builds/x86_64-centos7-gcc48-opt/clang_build_367044/lib/clang/10.0.0/include/ia32intrin.h:73:9: note: previous definition is here
master-x86_64-centos7-clang100-opt-cxxmodules: /cvmfs/sft.cern.ch/lcg/contrib/llvm/builds/x86_64-centos7-gcc48-opt/clang_build_367044/lib/clang/10.0.0/include/ia32intrin.h:73:9: note: previous definition is here
master-x86_64-centos7-clang100-opt-cxxmodules: /cvmfs/sft.cern.ch/lcg/contrib/llvm/builds/x86_64-centos7-gcc48-opt/clang_build_367044/lib/clang/10.0.0/include/ia32intrin.h:73:9: note: previous definition is here
master-x86_64-centos7-clang100-opt-cxxmodules: /cvmfs/sft.cern.ch/lcg/contrib/llvm/builds/x86_64-centos7-gcc48-opt/clang_build_367044/lib/clang/10.0.0/include/ia32intrin.h:73:9: note: previous definition is here
master-x86_64-centos7-clang100-opt-cxxmodules: /cvmfs/sft.cern.ch/lcg/contrib/llvm/builds/x86_64-centos7-gcc48-opt/clang_build_367044/lib/clang/10.0.0/include/ia32intrin.h:73:9: note: previous definition is here
master-x86_64-centos7-clang100-opt-cxxmodules: /cvmfs/sft.cern.ch/lcg/contrib/llvm/builds/x86_64-centos7-gcc48-opt/clang_build_367044/lib/clang/10.0.0/include/ia32intrin.h:73:9: note: previous definition is here
master-x86_64-centos7-clang100-opt-no-rt-cxxmodules: /cvmfs/sft.cern.ch/lcg/contrib/llvm/builds/x86_64-centos7-gcc48-opt/clang_build_367044/lib/clang/10.0.0/include/ia32intrin.h:73:9: note: previous definition is here
master-x86_64-centos7-clang100-opt-no-rt-cxxmodules: /cvmfs/sft.cern.ch/lcg/contrib/llvm/builds/x86_64-centos7-gcc48-opt/clang_build_367044/lib/clang/10.0.0/include/ia32intrin.h:73:9: note: previous definition is here
master-x86_64-centos7-clang100-opt-no-rt-cxxmodules: /cvmfs/sft.cern.ch/lcg/contrib/llvm/builds/x86_64-centos7-gcc48-opt/clang_build_367044/lib/clang/10.0.0/include/ia32intrin.h:73:9: note: previous definition is here
master-x86_64-centos7-clang100-opt-no-rt-cxxmodules: /cvmfs/sft.cern.ch/lcg/contrib/llvm/builds/x86_64-centos7-gcc48-opt/clang_build_367044/lib/clang/10.0.0/include/ia32intrin.h:73:9: note: previous definition is here
master-x86_64-centos7-clang100-opt-no-rt-cxxmodules: /cvmfs/sft.cern.ch/lcg/contrib/llvm/builds/x86_64-centos7-gcc48-opt/clang_build_367044/lib/clang/10.0.0/include/ia32intrin.h:73:9: note: previous definition is here
master-x86_64-centos7-clang100-opt-no-rt-cxxmodules: /cvmfs/sft.cern.ch/lcg/contrib/llvm/builds/x86_64-centos7-gcc48-opt/clang_build_367044/lib/clang/10.0.0/include/ia32intrin.h:73:9: note: previous definition is here
master-x86_64-centos7-clang100-opt-no-rt-cxxmodules: /cvmfs/sft.cern.ch/lcg/contrib/llvm/builds/x86_64-centos7-gcc48-opt/clang_build_367044/lib/clang/10.0.0/include/ia32intrin.h:73:9: note: previous definition is here
master-x86_64-centos7-clang100-opt-no-rt-cxxmodules: /cvmfs/sft.cern.ch/lcg/contrib/llvm/builds/x86_64-centos7-gcc48-opt/clang_build_367044/lib/clang/10.0.0/include/ia32intrin.h:73:9: note: previous definition is here
master-x86_64-centos7-clang100-opt-no-rt-cxxmodules: /cvmfs/sft.cern.ch/lcg/contrib/llvm/builds/x86_64-centos7-gcc48-opt/clang_build_367044/lib/clang/10.0.0/include/ia32intrin.h:73:9: note: previous definition is here
master-x86_64-centos7-clang100-opt-no-rt-cxxmodules: /cvmfs/sft.cern.ch/lcg/contrib/llvm/builds/x86_64-centos7-gcc48-opt/clang_build_367044/lib/clang/10.0.0/include/ia32intrin.h:73:9: note: previous definition is here
master-x86_64-centos7-clang100-opt-no-rt-cxxmodules: /cvmfs/sft.cern.ch/lcg/contrib/llvm/builds/x86_64-centos7-gcc48-opt/clang_build_367044/lib/clang/10.0.0/include/ia32intrin.h:73:9: note: previous definition is here
master-x86_64-centos7-clang100-opt-no-rt-cxxmodules: /cvmfs/sft.cern.ch/lcg/contrib/llvm/builds/x86_64-centos7-gcc48-opt/clang_build_367044/lib/clang/10.0.0/include/ia32intrin.h:73:9: note: previous definition is here
master-x86_64-centos7-clang100-opt-no-rt-cxxmodules: /cvmfs/sft.cern.ch/lcg/contrib/llvm/builds/x86_64-centos7-gcc48-opt/clang_build_367044/lib/clang/10.0.0/include/ia32intrin.h:73:9: note: previous definition is here
master-x86_64-centos7-clang100-opt-no-rt-cxxmodules: /cvmfs/sft.cern.ch/lcg/contrib/llvm/builds/x86_64-centos7-gcc48-opt/clang_build_367044/lib/clang/10.0.0/include/ia32intrin.h:73:9: note: previous definition is here
master-x86_64-centos7-clang100-opt-no-rt-cxxmodules: /cvmfs/sft.cern.ch/lcg/contrib/llvm/builds/x86_64-centos7-gcc48-opt/clang_build_367044/lib/clang/10.0.0/include/ia32intrin.h:73:9: note: previous definition is here
master-x86_64-centos7-clang100-opt-no-rt-cxxmodules: /cvmfs/sft.cern.ch/lcg/contrib/llvm/builds/x86_64-centos7-gcc48-opt/clang_build_367044/lib/clang/10.0.0/include/ia32intrin.h:73:9: note: previous definition is here
master-x86_64-centos7-clang100-opt-no-rt-cxxmodules: /cvmfs/sft.cern.ch/lcg/contrib/llvm/builds/x86_64-centos7-gcc48-opt/clang_build_367044/lib/clang/10.0.0/include/ia32intrin.h:73:9: note: previous definition is here
master-x86_64-centos7-clang100-opt-no-rt-cxxmodules: /cvmfs/sft.cern.ch/lcg/contrib/llvm/builds/x86_64-centos7-gcc48-opt/clang_build_367044/lib/clang/10.0.0/include/ia32intrin.h:73:9: note: previous definition is here
master-x86_64-centos7-clang100-opt-no-rt-cxxmodules: /cvmfs/sft.cern.ch/lcg/contrib/llvm/builds/x86_64-centos7-gcc48-opt/clang_build_367044/lib/clang/10.0.0/include/ia32intrin.h:73:9: note: previous definition is here
master-x86_64-centos7-clang100-opt-no-rt-cxxmodules: /cvmfs/sft.cern.ch/lcg/contrib/llvm/builds/x86_64-centos7-gcc48-opt/clang_build_367044/lib/clang/10.0.0/include/ia32intrin.h:73:9: note: previous definition is here
master-x86_64-centos7-clang100-opt-no-rt-cxxmodules: /cvmfs/sft.cern.ch/lcg/contrib/llvm/builds/x86_64-centos7-gcc48-opt/clang_build_367044/lib/clang/10.0.0/include/ia32intrin.h:73:9: note: previous definition is here
master-x86_64-centos7-clang100-opt-no-rt-cxxmodules: /cvmfs/sft.cern.ch/lcg/contrib/llvm/builds/x86_64-centos7-gcc48-opt/clang_build_367044/lib/clang/10.0.0/include/ia32intrin.h:73:9: note: previous definition is here
master-x86_64-centos7-clang100-opt-no-rt-cxxmodules: /cvmfs/sft.cern.ch/lcg/contrib/llvm/builds/x86_64-centos7-gcc48-opt/clang_build_367044/lib/clang/10.0.0/include/ia32intrin.h:73:9: note: previous definition is here
master-x86_64-centos7-clang100-opt-no-rt-cxxmodules: /cvmfs/sft.cern.ch/lcg/contrib/llvm/builds/x86_64-centos7-gcc48-opt/clang_build_367044/lib/clang/10.0.0/include/ia32intrin.h:73:9: note: previous definition is here

/cvmfs/sft.cern.ch/lcg/releases/gcc/6.2.0-b9934/x86_64-centos7/include/c++/6.2.0/ext/stdio_sync_filebuf.h

Errors:

master-x86_64-centos7-clang100-opt-cxxmodules: /cvmfs/sft.cern.ch/lcg/releases/gcc/6.2.0-b9934/x86_64-centos7/lib/gcc/x86_64-pc-linux-gnu/6.2.0/../../../../include/c++/6.2.0/ext/stdio_sync_filebuf.h:225:14: error: no member named '_IO_getc' in namespace 'std'; did you mean simply '_IO_getc'?
master-x86_64-centos7-clang100-opt-cxxmodules: /cvmfs/sft.cern.ch/lcg/releases/gcc/6.2.0-b9934/x86_64-centos7/lib/gcc/x86_64-pc-linux-gnu/6.2.0/../../../../include/c++/6.2.0/ext/stdio_sync_filebuf.h:235:14: error: no member named '_IO_putc' in namespace 'std'; did you mean simply '_IO_putc'?

/cvmfs/sft.cern.ch/lcg/views/LCG_rootext20180517/x86_64-centos7-gcc62-opt/include/Vc/common/bitscanintrinsics.h

Warnings:

master-x86_64-centos7-clang100-opt-master: /cvmfs/sft.cern.ch/lcg/views/LCG_rootext20180517/x86_64-centos7-gcc62-opt/include/Vc/scalar/../common/../sse/../common/bitscanintrinsics.h:37:13: warning: '_bit_scan_forward' macro redefined [-Wmacro-redefined]
master-x86_64-centos7-clang100-opt-master: /cvmfs/sft.cern.ch/lcg/views/LCG_rootext20180517/x86_64-centos7-gcc62-opt/include/Vc/scalar/../common/../sse/../common/bitscanintrinsics.h:37:13: warning: '_bit_scan_forward' macro redefined [-Wmacro-redefined]
master-x86_64-centos7-clang100-opt-master: /cvmfs/sft.cern.ch/lcg/views/LCG_rootext20180517/x86_64-centos7-gcc62-opt/include/Vc/scalar/../common/../sse/../common/bitscanintrinsics.h:37:13: warning: '_bit_scan_forward' macro redefined [-Wmacro-redefined]
master-x86_64-centos7-clang100-opt-master: /cvmfs/sft.cern.ch/lcg/views/LCG_rootext20180517/x86_64-centos7-gcc62-opt/include/Vc/scalar/../common/../sse/../common/bitscanintrinsics.h:37:13: warning: '_bit_scan_forward' macro redefined [-Wmacro-redefined]
master-x86_64-centos7-clang100-opt-master: /cvmfs/sft.cern.ch/lcg/views/LCG_rootext20180517/x86_64-centos7-gcc62-opt/include/Vc/scalar/../common/../sse/../common/bitscanintrinsics.h:37:13: warning: '_bit_scan_forward' macro redefined [-Wmacro-redefined]
master-x86_64-centos7-clang100-opt-master: /cvmfs/sft.cern.ch/lcg/views/LCG_rootext20180517/x86_64-centos7-gcc62-opt/include/Vc/scalar/../common/../sse/../common/bitscanintrinsics.h:37:13: warning: '_bit_scan_forward' macro redefined [-Wmacro-redefined]
master-x86_64-centos7-clang100-opt-master: /cvmfs/sft.cern.ch/lcg/views/LCG_rootext20180517/x86_64-centos7-gcc62-opt/include/Vc/scalar/../common/../sse/../common/bitscanintrinsics.h:37:13: warning: '_bit_scan_forward' macro redefined [-Wmacro-redefined]
master-x86_64-centos7-clang100-opt-master: /cvmfs/sft.cern.ch/lcg/views/LCG_rootext20180517/x86_64-centos7-gcc62-opt/include/Vc/scalar/../common/../sse/../common/bitscanintrinsics.h:37:13: warning: '_bit_scan_forward' macro redefined [-Wmacro-redefined]
master-x86_64-centos7-clang100-opt-master: /cvmfs/sft.cern.ch/lcg/views/LCG_rootext20180517/x86_64-centos7-gcc62-opt/include/Vc/scalar/../common/../sse/../common/bitscanintrinsics.h:37:13: warning: '_bit_scan_forward' macro redefined [-Wmacro-redefined]
master-x86_64-centos7-clang100-opt-master: /cvmfs/sft.cern.ch/lcg/views/LCG_rootext20180517/x86_64-centos7-gcc62-opt/include/Vc/scalar/../common/../sse/../common/bitscanintrinsics.h:37:13: warning: '_bit_scan_forward' macro redefined [-Wmacro-redefined]
master-x86_64-centos7-clang100-opt-master: /cvmfs/sft.cern.ch/lcg/views/LCG_rootext20180517/x86_64-centos7-gcc62-opt/include/Vc/scalar/../common/../sse/../common/bitscanintrinsics.h:37:13: warning: '_bit_scan_forward' macro redefined [-Wmacro-redefined]
master-x86_64-centos7-clang100-opt-master: /cvmfs/sft.cern.ch/lcg/views/LCG_rootext20180517/x86_64-centos7-gcc62-opt/include/Vc/scalar/../common/../sse/../common/bitscanintrinsics.h:37:13: warning: '_bit_scan_forward' macro redefined [-Wmacro-redefined]
master-x86_64-centos7-clang100-opt-master: /cvmfs/sft.cern.ch/lcg/views/LCG_rootext20180517/x86_64-centos7-gcc62-opt/include/Vc/scalar/../common/../sse/../common/bitscanintrinsics.h:37:13: warning: '_bit_scan_forward' macro redefined [-Wmacro-redefined]
master-x86_64-centos7-clang100-opt-master: /cvmfs/sft.cern.ch/lcg/views/LCG_rootext20180517/x86_64-centos7-gcc62-opt/include/Vc/scalar/../common/../sse/../common/bitscanintrinsics.h:37:13: warning: '_bit_scan_forward' macro redefined [-Wmacro-redefined]
master-x86_64-centos7-clang100-opt-master: /cvmfs/sft.cern.ch/lcg/views/LCG_rootext20180517/x86_64-centos7-gcc62-opt/include/Vc/scalar/../common/../sse/../common/bitscanintrinsics.h:37:13: warning: '_bit_scan_forward' macro redefined [-Wmacro-redefined]
master-x86_64-centos7-clang100-opt-master: /cvmfs/sft.cern.ch/lcg/views/LCG_rootext20180517/x86_64-centos7-gcc62-opt/include/Vc/scalar/../common/../sse/../common/bitscanintrinsics.h:37:13: warning: '_bit_scan_forward' macro redefined [-Wmacro-redefined]
master-x86_64-centos7-clang100-opt-master: /cvmfs/sft.cern.ch/lcg/views/LCG_rootext20180517/x86_64-centos7-gcc62-opt/include/Vc/scalar/../common/../sse/../common/bitscanintrinsics.h:37:13: warning: '_bit_scan_forward' macro redefined [-Wmacro-redefined]
master-x86_64-centos7-clang100-opt-master: /cvmfs/sft.cern.ch/lcg/views/LCG_rootext20180517/x86_64-centos7-gcc62-opt/include/Vc/scalar/../common/../sse/../common/bitscanintrinsics.h:37:13: warning: '_bit_scan_forward' macro redefined [-Wmacro-redefined]
master-x86_64-centos7-clang100-opt-master: /cvmfs/sft.cern.ch/lcg/views/LCG_rootext20180517/x86_64-centos7-gcc62-opt/include/Vc/scalar/../common/../sse/../common/bitscanintrinsics.h:37:13: warning: '_bit_scan_forward' macro redefined [-Wmacro-redefined]
master-x86_64-centos7-clang100-opt-master: /cvmfs/sft.cern.ch/lcg/views/LCG_rootext20180517/x86_64-centos7-gcc62-opt/include/Vc/scalar/../common/../sse/../common/bitscanintrinsics.h:37:13: warning: '_bit_scan_forward' macro redefined [-Wmacro-redefined]
master-x86_64-centos7-clang100-opt-master: /cvmfs/sft.cern.ch/lcg/views/LCG_rootext20180517/x86_64-centos7-gcc62-opt/include/Vc/scalar/../common/../sse/../common/bitscanintrinsics.h:37:13: warning: '_bit_scan_forward' macro redefined [-Wmacro-redefined]
master-x86_64-centos7-clang100-opt-master: /cvmfs/sft.cern.ch/lcg/views/LCG_rootext20180517/x86_64-centos7-gcc62-opt/include/Vc/scalar/../common/../sse/../common/bitscanintrinsics.h:37:13: warning: '_bit_scan_forward' macro redefined [-Wmacro-redefined]
master-x86_64-centos7-clang100-opt-master: /cvmfs/sft.cern.ch/lcg/views/LCG_rootext20180517/x86_64-centos7-gcc62-opt/include/Vc/scalar/../common/../sse/../common/bitscanintrinsics.h:37:13: warning: '_bit_scan_forward' macro redefined [-Wmacro-redefined]
master-x86_64-centos7-clang100-opt-master: /cvmfs/sft.cern.ch/lcg/views/LCG_rootext20180517/x86_64-centos7-gcc62-opt/include/Vc/scalar/../common/../sse/../common/bitscanintrinsics.h:37:13: warning: '_bit_scan_forward' macro redefined [-Wmacro-redefined]
master-x86_64-centos7-clang100-opt-cxxmodules: /cvmfs/sft.cern.ch/lcg/views/LCG_rootext20180517/x86_64-centos7-gcc62-opt/lib/cmake/VecCore/../../../include/Vc/scalar/../common/../sse/../common/bitscanintrinsics.h:37:13: warning: '_bit_scan_forward' macro redefined [-Wmacro-redefined]
master-x86_64-centos7-clang100-opt-cxxmodules: /cvmfs/sft.cern.ch/lcg/views/LCG_rootext20180517/x86_64-centos7-gcc62-opt/include/Vc/scalar/../common/../sse/../common/bitscanintrinsics.h:37:13: warning: '_bit_scan_forward' macro redefined [-Wmacro-redefined]
master-x86_64-centos7-clang100-opt-cxxmodules: /cvmfs/sft.cern.ch/lcg/views/LCG_rootext20180517/x86_64-centos7-gcc62-opt/include/Vc/scalar/../common/../sse/../common/bitscanintrinsics.h:37:13: warning: '_bit_scan_forward' macro redefined [-Wmacro-redefined]
master-x86_64-centos7-clang100-opt-cxxmodules: /cvmfs/sft.cern.ch/lcg/views/LCG_rootext20180517/x86_64-centos7-gcc62-opt/include/Vc/scalar/../common/../sse/../common/bitscanintrinsics.h:37:13: warning: '_bit_scan_forward' macro redefined [-Wmacro-redefined]
master-x86_64-centos7-clang100-opt-cxxmodules: /cvmfs/sft.cern.ch/lcg/views/LCG_rootext20180517/x86_64-centos7-gcc62-opt/include/Vc/scalar/../common/../sse/../common/bitscanintrinsics.h:37:13: warning: '_bit_scan_forward' macro redefined [-Wmacro-redefined]
master-x86_64-centos7-clang100-opt-cxxmodules: /cvmfs/sft.cern.ch/lcg/views/LCG_rootext20180517/x86_64-centos7-gcc62-opt/include/Vc/scalar/../common/../sse/../common/bitscanintrinsics.h:37:13: warning: '_bit_scan_forward' macro redefined [-Wmacro-redefined]
master-x86_64-centos7-clang100-opt-cxxmodules: /cvmfs/sft.cern.ch/lcg/views/LCG_rootext20180517/x86_64-centos7-gcc62-opt/include/Vc/scalar/../common/../sse/../common/bitscanintrinsics.h:37:13: warning: '_bit_scan_forward' macro redefined [-Wmacro-redefined]
master-x86_64-centos7-clang100-opt-cxxmodules: /cvmfs/sft.cern.ch/lcg/views/LCG_rootext20180517/x86_64-centos7-gcc62-opt/include/Vc/scalar/../common/../sse/../common/bitscanintrinsics.h:37:13: warning: '_bit_scan_forward' macro redefined [-Wmacro-redefined]
master-x86_64-centos7-clang100-opt-cxxmodules: /cvmfs/sft.cern.ch/lcg/views/LCG_rootext20180517/x86_64-centos7-gcc62-opt/include/Vc/scalar/../common/../sse/../common/bitscanintrinsics.h:37:13: warning: '_bit_scan_forward' macro redefined [-Wmacro-redefined]
master-x86_64-centos7-clang100-opt-cxxmodules: /cvmfs/sft.cern.ch/lcg/views/LCG_rootext20180517/x86_64-centos7-gcc62-opt/include/Vc/scalar/../common/../sse/../common/bitscanintrinsics.h:37:13: warning: '_bit_scan_forward' macro redefined [-Wmacro-redefined]
master-x86_64-centos7-clang100-opt-cxxmodules: /cvmfs/sft.cern.ch/lcg/views/LCG_rootext20180517/x86_64-centos7-gcc62-opt/lib/cmake/VecCore/../../../include/Vc/scalar/../common/../sse/../common/bitscanintrinsics.h:37:13: warning: '_bit_scan_forward' macro redefined [-Wmacro-redefined]
master-x86_64-centos7-clang100-opt-no-rt-cxxmodules: /cvmfs/sft.cern.ch/lcg/views/LCG_rootext20180517/x86_64-centos7-gcc62-opt/include/Vc/scalar/../common/../sse/../common/bitscanintrinsics.h:37:13: warning: '_bit_scan_forward' macro redefined [-Wmacro-redefined]
master-x86_64-centos7-clang100-opt-no-rt-cxxmodules: /cvmfs/sft.cern.ch/lcg/views/LCG_rootext20180517/x86_64-centos7-gcc62-opt/include/Vc/scalar/../common/../sse/../common/bitscanintrinsics.h:37:13: warning: '_bit_scan_forward' macro redefined [-Wmacro-redefined]
master-x86_64-centos7-clang100-opt-no-rt-cxxmodules: /cvmfs/sft.cern.ch/lcg/views/LCG_rootext20180517/x86_64-centos7-gcc62-opt/include/Vc/scalar/../common/../sse/../common/bitscanintrinsics.h:37:13: warning: '_bit_scan_forward' macro redefined [-Wmacro-redefined]
master-x86_64-centos7-clang100-opt-no-rt-cxxmodules: /cvmfs/sft.cern.ch/lcg/views/LCG_rootext20180517/x86_64-centos7-gcc62-opt/include/Vc/scalar/../common/../sse/../common/bitscanintrinsics.h:37:13: warning: '_bit_scan_forward' macro redefined [-Wmacro-redefined]
master-x86_64-centos7-clang100-opt-no-rt-cxxmodules: /cvmfs/sft.cern.ch/lcg/views/LCG_rootext20180517/x86_64-centos7-gcc62-opt/include/Vc/scalar/../common/../sse/../common/bitscanintrinsics.h:37:13: warning: '_bit_scan_forward' macro redefined [-Wmacro-redefined]
master-x86_64-centos7-clang100-opt-no-rt-cxxmodules: /cvmfs/sft.cern.ch/lcg/views/LCG_rootext20180517/x86_64-centos7-gcc62-opt/include/Vc/scalar/../common/../sse/../common/bitscanintrinsics.h:37:13: warning: '_bit_scan_forward' macro redefined [-Wmacro-redefined]
master-x86_64-centos7-clang100-opt-no-rt-cxxmodules: /cvmfs/sft.cern.ch/lcg/views/LCG_rootext20180517/x86_64-centos7-gcc62-opt/include/Vc/scalar/../common/../sse/../common/bitscanintrinsics.h:37:13: warning: '_bit_scan_forward' macro redefined [-Wmacro-redefined]
master-x86_64-centos7-clang100-opt-no-rt-cxxmodules: /cvmfs/sft.cern.ch/lcg/views/LCG_rootext20180517/x86_64-centos7-gcc62-opt/include/Vc/scalar/../common/../sse/../common/bitscanintrinsics.h:37:13: warning: '_bit_scan_forward' macro redefined [-Wmacro-redefined]
master-x86_64-centos7-clang100-opt-no-rt-cxxmodules: /cvmfs/sft.cern.ch/lcg/views/LCG_rootext20180517/x86_64-centos7-gcc62-opt/include/Vc/scalar/../common/../sse/../common/bitscanintrinsics.h:37:13: warning: '_bit_scan_forward' macro redefined [-Wmacro-redefined]
master-x86_64-centos7-clang100-opt-no-rt-cxxmodules: /cvmfs/sft.cern.ch/lcg/views/LCG_rootext20180517/x86_64-centos7-gcc62-opt/include/Vc/scalar/../common/../sse/../common/bitscanintrinsics.h:37:13: warning: '_bit_scan_forward' macro redefined [-Wmacro-redefined]
master-x86_64-centos7-clang100-opt-no-rt-cxxmodules: /cvmfs/sft.cern.ch/lcg/views/LCG_rootext20180517/x86_64-centos7-gcc62-opt/include/Vc/scalar/../common/../sse/../common/bitscanintrinsics.h:37:13: warning: '_bit_scan_forward' macro redefined [-Wmacro-redefined]
master-x86_64-centos7-clang100-opt-no-rt-cxxmodules: /cvmfs/sft.cern.ch/lcg/views/LCG_rootext20180517/x86_64-centos7-gcc62-opt/include/Vc/scalar/../common/../sse/../common/bitscanintrinsics.h:37:13: warning: '_bit_scan_forward' macro redefined [-Wmacro-redefined]
master-x86_64-centos7-clang100-opt-no-rt-cxxmodules: /cvmfs/sft.cern.ch/lcg/views/LCG_rootext20180517/x86_64-centos7-gcc62-opt/include/Vc/scalar/../common/../sse/../common/bitscanintrinsics.h:37:13: warning: '_bit_scan_forward' macro redefined [-Wmacro-redefined]
master-x86_64-centos7-clang100-opt-no-rt-cxxmodules: /cvmfs/sft.cern.ch/lcg/views/LCG_rootext20180517/x86_64-centos7-gcc62-opt/include/Vc/scalar/../common/../sse/../common/bitscanintrinsics.h:37:13: warning: '_bit_scan_forward' macro redefined [-Wmacro-redefined]
master-x86_64-centos7-clang100-opt-no-rt-cxxmodules: /cvmfs/sft.cern.ch/lcg/views/LCG_rootext20180517/x86_64-centos7-gcc62-opt/include/Vc/scalar/../common/../sse/../common/bitscanintrinsics.h:37:13: warning: '_bit_scan_forward' macro redefined [-Wmacro-redefined]
master-x86_64-centos7-clang100-opt-no-rt-cxxmodules: /cvmfs/sft.cern.ch/lcg/views/LCG_rootext20180517/x86_64-centos7-gcc62-opt/include/Vc/scalar/../common/../sse/../common/bitscanintrinsics.h:37:13: warning: '_bit_scan_forward' macro redefined [-Wmacro-redefined]
master-x86_64-centos7-clang100-opt-no-rt-cxxmodules: /cvmfs/sft.cern.ch/lcg/views/LCG_rootext20180517/x86_64-centos7-gcc62-opt/include/Vc/scalar/../common/../sse/../common/bitscanintrinsics.h:37:13: warning: '_bit_scan_forward' macro redefined [-Wmacro-redefined]
master-x86_64-centos7-clang100-opt-no-rt-cxxmodules: /cvmfs/sft.cern.ch/lcg/views/LCG_rootext20180517/x86_64-centos7-gcc62-opt/include/Vc/scalar/../common/../sse/../common/bitscanintrinsics.h:37:13: warning: '_bit_scan_forward' macro redefined [-Wmacro-redefined]
master-x86_64-centos7-clang100-opt-no-rt-cxxmodules: /cvmfs/sft.cern.ch/lcg/views/LCG_rootext20180517/x86_64-centos7-gcc62-opt/include/Vc/scalar/../common/../sse/../common/bitscanintrinsics.h:37:13: warning: '_bit_scan_forward' macro redefined [-Wmacro-redefined]
master-x86_64-centos7-clang100-opt-no-rt-cxxmodules: /cvmfs/sft.cern.ch/lcg/views/LCG_rootext20180517/x86_64-centos7-gcc62-opt/include/Vc/scalar/../common/../sse/../common/bitscanintrinsics.h:37:13: warning: '_bit_scan_forward' macro redefined [-Wmacro-redefined]
master-x86_64-centos7-clang100-opt-no-rt-cxxmodules: /cvmfs/sft.cern.ch/lcg/views/LCG_rootext20180517/x86_64-centos7-gcc62-opt/include/Vc/scalar/../common/../sse/../common/bitscanintrinsics.h:37:13: warning: '_bit_scan_forward' macro redefined [-Wmacro-redefined]
master-x86_64-centos7-clang100-opt-no-rt-cxxmodules: /cvmfs/sft.cern.ch/lcg/views/LCG_rootext20180517/x86_64-centos7-gcc62-opt/include/Vc/scalar/../common/../sse/../common/bitscanintrinsics.h:37:13: warning: '_bit_scan_forward' macro redefined [-Wmacro-redefined]
master-x86_64-centos7-clang100-opt-no-rt-cxxmodules: /cvmfs/sft.cern.ch/lcg/views/LCG_rootext20180517/x86_64-centos7-gcc62-opt/include/Vc/scalar/../common/../sse/../common/bitscanintrinsics.h:37:13: warning: '_bit_scan_forward' macro redefined [-Wmacro-redefined]
master-x86_64-centos7-clang100-opt-no-rt-cxxmodules: /cvmfs/sft.cern.ch/lcg/views/LCG_rootext20180517/x86_64-centos7-gcc62-opt/include/Vc/scalar/../common/../sse/../common/bitscanintrinsics.h:37:13: warning: '_bit_scan_forward' macro redefined [-Wmacro-redefined]
master-x86_64-centos7-clang100-opt-master: /cvmfs/sft.cern.ch/lcg/views/LCG_rootext20180517/x86_64-centos7-gcc62-opt/include/Vc/scalar/../common/../sse/../common/bitscanintrinsics.h:44:13: warning: '_bit_scan_reverse' macro redefined [-Wmacro-redefined]
master-x86_64-centos7-clang100-opt-master: /cvmfs/sft.cern.ch/lcg/views/LCG_rootext20180517/x86_64-centos7-gcc62-opt/include/Vc/scalar/../common/../sse/../common/bitscanintrinsics.h:44:13: warning: '_bit_scan_reverse' macro redefined [-Wmacro-redefined]
master-x86_64-centos7-clang100-opt-master: /cvmfs/sft.cern.ch/lcg/views/LCG_rootext20180517/x86_64-centos7-gcc62-opt/include/Vc/scalar/../common/../sse/../common/bitscanintrinsics.h:44:13: warning: '_bit_scan_reverse' macro redefined [-Wmacro-redefined]
master-x86_64-centos7-clang100-opt-master: /cvmfs/sft.cern.ch/lcg/views/LCG_rootext20180517/x86_64-centos7-gcc62-opt/include/Vc/scalar/../common/../sse/../common/bitscanintrinsics.h:44:13: warning: '_bit_scan_reverse' macro redefined [-Wmacro-redefined]
master-x86_64-centos7-clang100-opt-master: /cvmfs/sft.cern.ch/lcg/views/LCG_rootext20180517/x86_64-centos7-gcc62-opt/include/Vc/scalar/../common/../sse/../common/bitscanintrinsics.h:44:13: warning: '_bit_scan_reverse' macro redefined [-Wmacro-redefined]
master-x86_64-centos7-clang100-opt-master: /cvmfs/sft.cern.ch/lcg/views/LCG_rootext20180517/x86_64-centos7-gcc62-opt/include/Vc/scalar/../common/../sse/../common/bitscanintrinsics.h:44:13: warning: '_bit_scan_reverse' macro redefined [-Wmacro-redefined]
master-x86_64-centos7-clang100-opt-master: /cvmfs/sft.cern.ch/lcg/views/LCG_rootext20180517/x86_64-centos7-gcc62-opt/include/Vc/scalar/../common/../sse/../common/bitscanintrinsics.h:44:13: warning: '_bit_scan_reverse' macro redefined [-Wmacro-redefined]
master-x86_64-centos7-clang100-opt-master: /cvmfs/sft.cern.ch/lcg/views/LCG_rootext20180517/x86_64-centos7-gcc62-opt/include/Vc/scalar/../common/../sse/../common/bitscanintrinsics.h:44:13: warning: '_bit_scan_reverse' macro redefined [-Wmacro-redefined]
master-x86_64-centos7-clang100-opt-master: /cvmfs/sft.cern.ch/lcg/views/LCG_rootext20180517/x86_64-centos7-gcc62-opt/include/Vc/scalar/../common/../sse/../common/bitscanintrinsics.h:44:13: warning: '_bit_scan_reverse' macro redefined [-Wmacro-redefined]
master-x86_64-centos7-clang100-opt-master: /cvmfs/sft.cern.ch/lcg/views/LCG_rootext20180517/x86_64-centos7-gcc62-opt/include/Vc/scalar/../common/../sse/../common/bitscanintrinsics.h:44:13: warning: '_bit_scan_reverse' macro redefined [-Wmacro-redefined]
master-x86_64-centos7-clang100-opt-master: /cvmfs/sft.cern.ch/lcg/views/LCG_rootext20180517/x86_64-centos7-gcc62-opt/include/Vc/scalar/../common/../sse/../common/bitscanintrinsics.h:44:13: warning: '_bit_scan_reverse' macro redefined [-Wmacro-redefined]
master-x86_64-centos7-clang100-opt-master: /cvmfs/sft.cern.ch/lcg/views/LCG_rootext20180517/x86_64-centos7-gcc62-opt/include/Vc/scalar/../common/../sse/../common/bitscanintrinsics.h:44:13: warning: '_bit_scan_reverse' macro redefined [-Wmacro-redefined]
master-x86_64-centos7-clang100-opt-master: /cvmfs/sft.cern.ch/lcg/views/LCG_rootext20180517/x86_64-centos7-gcc62-opt/include/Vc/scalar/../common/../sse/../common/bitscanintrinsics.h:44:13: warning: '_bit_scan_reverse' macro redefined [-Wmacro-redefined]
master-x86_64-centos7-clang100-opt-master: /cvmfs/sft.cern.ch/lcg/views/LCG_rootext20180517/x86_64-centos7-gcc62-opt/include/Vc/scalar/../common/../sse/../common/bitscanintrinsics.h:44:13: warning: '_bit_scan_reverse' macro redefined [-Wmacro-redefined]
master-x86_64-centos7-clang100-opt-master: /cvmfs/sft.cern.ch/lcg/views/LCG_rootext20180517/x86_64-centos7-gcc62-opt/include/Vc/scalar/../common/../sse/../common/bitscanintrinsics.h:44:13: warning: '_bit_scan_reverse' macro redefined [-Wmacro-redefined]
master-x86_64-centos7-clang100-opt-master: /cvmfs/sft.cern.ch/lcg/views/LCG_rootext20180517/x86_64-centos7-gcc62-opt/include/Vc/scalar/../common/../sse/../common/bitscanintrinsics.h:44:13: warning: '_bit_scan_reverse' macro redefined [-Wmacro-redefined]
master-x86_64-centos7-clang100-opt-master: /cvmfs/sft.cern.ch/lcg/views/LCG_rootext20180517/x86_64-centos7-gcc62-opt/include/Vc/scalar/../common/../sse/../common/bitscanintrinsics.h:44:13: warning: '_bit_scan_reverse' macro redefined [-Wmacro-redefined]
master-x86_64-centos7-clang100-opt-master: /cvmfs/sft.cern.ch/lcg/views/LCG_rootext20180517/x86_64-centos7-gcc62-opt/include/Vc/scalar/../common/../sse/../common/bitscanintrinsics.h:44:13: warning: '_bit_scan_reverse' macro redefined [-Wmacro-redefined]
master-x86_64-centos7-clang100-opt-master: /cvmfs/sft.cern.ch/lcg/views/LCG_rootext20180517/x86_64-centos7-gcc62-opt/include/Vc/scalar/../common/../sse/../common/bitscanintrinsics.h:44:13: warning: '_bit_scan_reverse' macro redefined [-Wmacro-redefined]
master-x86_64-centos7-clang100-opt-master: /cvmfs/sft.cern.ch/lcg/views/LCG_rootext20180517/x86_64-centos7-gcc62-opt/include/Vc/scalar/../common/../sse/../common/bitscanintrinsics.h:44:13: warning: '_bit_scan_reverse' macro redefined [-Wmacro-redefined]
master-x86_64-centos7-clang100-opt-master: /cvmfs/sft.cern.ch/lcg/views/LCG_rootext20180517/x86_64-centos7-gcc62-opt/include/Vc/scalar/../common/../sse/../common/bitscanintrinsics.h:44:13: warning: '_bit_scan_reverse' macro redefined [-Wmacro-redefined]
master-x86_64-centos7-clang100-opt-master: /cvmfs/sft.cern.ch/lcg/views/LCG_rootext20180517/x86_64-centos7-gcc62-opt/include/Vc/scalar/../common/../sse/../common/bitscanintrinsics.h:44:13: warning: '_bit_scan_reverse' macro redefined [-Wmacro-redefined]
master-x86_64-centos7-clang100-opt-master: /cvmfs/sft.cern.ch/lcg/views/LCG_rootext20180517/x86_64-centos7-gcc62-opt/include/Vc/scalar/../common/../sse/../common/bitscanintrinsics.h:44:13: warning: '_bit_scan_reverse' macro redefined [-Wmacro-redefined]
master-x86_64-centos7-clang100-opt-master: /cvmfs/sft.cern.ch/lcg/views/LCG_rootext20180517/x86_64-centos7-gcc62-opt/include/Vc/scalar/../common/../sse/../common/bitscanintrinsics.h:44:13: warning: '_bit_scan_reverse' macro redefined [-Wmacro-redefined]
master-x86_64-centos7-clang100-opt-cxxmodules: /cvmfs/sft.cern.ch/lcg/views/LCG_rootext20180517/x86_64-centos7-gcc62-opt/lib/cmake/VecCore/../../../include/Vc/scalar/../common/../sse/../common/bitscanintrinsics.h:44:13: warning: '_bit_scan_reverse' macro redefined [-Wmacro-redefined]
master-x86_64-centos7-clang100-opt-cxxmodules: /cvmfs/sft.cern.ch/lcg/views/LCG_rootext20180517/x86_64-centos7-gcc62-opt/include/Vc/scalar/../common/../sse/../common/bitscanintrinsics.h:44:13: warning: '_bit_scan_reverse' macro redefined [-Wmacro-redefined]
master-x86_64-centos7-clang100-opt-cxxmodules: /cvmfs/sft.cern.ch/lcg/views/LCG_rootext20180517/x86_64-centos7-gcc62-opt/include/Vc/scalar/../common/../sse/../common/bitscanintrinsics.h:44:13: warning: '_bit_scan_reverse' macro redefined [-Wmacro-redefined]
master-x86_64-centos7-clang100-opt-cxxmodules: /cvmfs/sft.cern.ch/lcg/views/LCG_rootext20180517/x86_64-centos7-gcc62-opt/include/Vc/scalar/../common/../sse/../common/bitscanintrinsics.h:44:13: warning: '_bit_scan_reverse' macro redefined [-Wmacro-redefined]
master-x86_64-centos7-clang100-opt-cxxmodules: /cvmfs/sft.cern.ch/lcg/views/LCG_rootext20180517/x86_64-centos7-gcc62-opt/include/Vc/scalar/../common/../sse/../common/bitscanintrinsics.h:44:13: warning: '_bit_scan_reverse' macro redefined [-Wmacro-redefined]
master-x86_64-centos7-clang100-opt-cxxmodules: /cvmfs/sft.cern.ch/lcg/views/LCG_rootext20180517/x86_64-centos7-gcc62-opt/include/Vc/scalar/../common/../sse/../common/bitscanintrinsics.h:44:13: warning: '_bit_scan_reverse' macro redefined [-Wmacro-redefined]
master-x86_64-centos7-clang100-opt-cxxmodules: /cvmfs/sft.cern.ch/lcg/views/LCG_rootext20180517/x86_64-centos7-gcc62-opt/include/Vc/scalar/../common/../sse/../common/bitscanintrinsics.h:44:13: warning: '_bit_scan_reverse' macro redefined [-Wmacro-redefined]
master-x86_64-centos7-clang100-opt-cxxmodules: /cvmfs/sft.cern.ch/lcg/views/LCG_rootext20180517/x86_64-centos7-gcc62-opt/include/Vc/scalar/../common/../sse/../common/bitscanintrinsics.h:44:13: warning: '_bit_scan_reverse' macro redefined [-Wmacro-redefined]
master-x86_64-centos7-clang100-opt-cxxmodules: /cvmfs/sft.cern.ch/lcg/views/LCG_rootext20180517/x86_64-centos7-gcc62-opt/include/Vc/scalar/../common/../sse/../common/bitscanintrinsics.h:44:13: warning: '_bit_scan_reverse' macro redefined [-Wmacro-redefined]
master-x86_64-centos7-clang100-opt-cxxmodules: /cvmfs/sft.cern.ch/lcg/views/LCG_rootext20180517/x86_64-centos7-gcc62-opt/lib/cmake/VecCore/../../../include/Vc/scalar/../common/../sse/../common/bitscanintrinsics.h:44:13: warning: '_bit_scan_reverse' macro redefined [-Wmacro-redefined]
master-x86_64-centos7-clang100-opt-no-rt-cxxmodules: /cvmfs/sft.cern.ch/lcg/views/LCG_rootext20180517/x86_64-centos7-gcc62-opt/include/Vc/scalar/../common/../sse/../common/bitscanintrinsics.h:44:13: warning: '_bit_scan_reverse' macro redefined [-Wmacro-redefined]
master-x86_64-centos7-clang100-opt-no-rt-cxxmodules: /cvmfs/sft.cern.ch/lcg/views/LCG_rootext20180517/x86_64-centos7-gcc62-opt/include/Vc/scalar/../common/../sse/../common/bitscanintrinsics.h:44:13: warning: '_bit_scan_reverse' macro redefined [-Wmacro-redefined]
master-x86_64-centos7-clang100-opt-no-rt-cxxmodules: /cvmfs/sft.cern.ch/lcg/views/LCG_rootext20180517/x86_64-centos7-gcc62-opt/include/Vc/scalar/../common/../sse/../common/bitscanintrinsics.h:44:13: warning: '_bit_scan_reverse' macro redefined [-Wmacro-redefined]
master-x86_64-centos7-clang100-opt-no-rt-cxxmodules: /cvmfs/sft.cern.ch/lcg/views/LCG_rootext20180517/x86_64-centos7-gcc62-opt/include/Vc/scalar/../common/../sse/../common/bitscanintrinsics.h:44:13: warning: '_bit_scan_reverse' macro redefined [-Wmacro-redefined]
master-x86_64-centos7-clang100-opt-no-rt-cxxmodules: /cvmfs/sft.cern.ch/lcg/views/LCG_rootext20180517/x86_64-centos7-gcc62-opt/include/Vc/scalar/../common/../sse/../common/bitscanintrinsics.h:44:13: warning: '_bit_scan_reverse' macro redefined [-Wmacro-redefined]
master-x86_64-centos7-clang100-opt-no-rt-cxxmodules: /cvmfs/sft.cern.ch/lcg/views/LCG_rootext20180517/x86_64-centos7-gcc62-opt/include/Vc/scalar/../common/../sse/../common/bitscanintrinsics.h:44:13: warning: '_bit_scan_reverse' macro redefined [-Wmacro-redefined]
master-x86_64-centos7-clang100-opt-no-rt-cxxmodules: /cvmfs/sft.cern.ch/lcg/views/LCG_rootext20180517/x86_64-centos7-gcc62-opt/include/Vc/scalar/../common/../sse/../common/bitscanintrinsics.h:44:13: warning: '_bit_scan_reverse' macro redefined [-Wmacro-redefined]
master-x86_64-centos7-clang100-opt-no-rt-cxxmodules: /cvmfs/sft.cern.ch/lcg/views/LCG_rootext20180517/x86_64-centos7-gcc62-opt/include/Vc/scalar/../common/../sse/../common/bitscanintrinsics.h:44:13: warning: '_bit_scan_reverse' macro redefined [-Wmacro-redefined]
master-x86_64-centos7-clang100-opt-no-rt-cxxmodules: /cvmfs/sft.cern.ch/lcg/views/LCG_rootext20180517/x86_64-centos7-gcc62-opt/include/Vc/scalar/../common/../sse/../common/bitscanintrinsics.h:44:13: warning: '_bit_scan_reverse' macro redefined [-Wmacro-redefined]
master-x86_64-centos7-clang100-opt-no-rt-cxxmodules: /cvmfs/sft.cern.ch/lcg/views/LCG_rootext20180517/x86_64-centos7-gcc62-opt/include/Vc/scalar/../common/../sse/../common/bitscanintrinsics.h:44:13: warning: '_bit_scan_reverse' macro redefined [-Wmacro-redefined]
master-x86_64-centos7-clang100-opt-no-rt-cxxmodules: /cvmfs/sft.cern.ch/lcg/views/LCG_rootext20180517/x86_64-centos7-gcc62-opt/include/Vc/scalar/../common/../sse/../common/bitscanintrinsics.h:44:13: warning: '_bit_scan_reverse' macro redefined [-Wmacro-redefined]
master-x86_64-centos7-clang100-opt-no-rt-cxxmodules: /cvmfs/sft.cern.ch/lcg/views/LCG_rootext20180517/x86_64-centos7-gcc62-opt/include/Vc/scalar/../common/../sse/../common/bitscanintrinsics.h:44:13: warning: '_bit_scan_reverse' macro redefined [-Wmacro-redefined]
master-x86_64-centos7-clang100-opt-no-rt-cxxmodules: /cvmfs/sft.cern.ch/lcg/views/LCG_rootext20180517/x86_64-centos7-gcc62-opt/include/Vc/scalar/../common/../sse/../common/bitscanintrinsics.h:44:13: warning: '_bit_scan_reverse' macro redefined [-Wmacro-redefined]
master-x86_64-centos7-clang100-opt-no-rt-cxxmodules: /cvmfs/sft.cern.ch/lcg/views/LCG_rootext20180517/x86_64-centos7-gcc62-opt/include/Vc/scalar/../common/../sse/../common/bitscanintrinsics.h:44:13: warning: '_bit_scan_reverse' macro redefined [-Wmacro-redefined]
master-x86_64-centos7-clang100-opt-no-rt-cxxmodules: /cvmfs/sft.cern.ch/lcg/views/LCG_rootext20180517/x86_64-centos7-gcc62-opt/include/Vc/scalar/../common/../sse/../common/bitscanintrinsics.h:44:13: warning: '_bit_scan_reverse' macro redefined [-Wmacro-redefined]
master-x86_64-centos7-clang100-opt-no-rt-cxxmodules: /cvmfs/sft.cern.ch/lcg/views/LCG_rootext20180517/x86_64-centos7-gcc62-opt/include/Vc/scalar/../common/../sse/../common/bitscanintrinsics.h:44:13: warning: '_bit_scan_reverse' macro redefined [-Wmacro-redefined]
master-x86_64-centos7-clang100-opt-no-rt-cxxmodules: /cvmfs/sft.cern.ch/lcg/views/LCG_rootext20180517/x86_64-centos7-gcc62-opt/include/Vc/scalar/../common/../sse/../common/bitscanintrinsics.h:44:13: warning: '_bit_scan_reverse' macro redefined [-Wmacro-redefined]
master-x86_64-centos7-clang100-opt-no-rt-cxxmodules: /cvmfs/sft.cern.ch/lcg/views/LCG_rootext20180517/x86_64-centos7-gcc62-opt/include/Vc/scalar/../common/../sse/../common/bitscanintrinsics.h:44:13: warning: '_bit_scan_reverse' macro redefined [-Wmacro-redefined]
master-x86_64-centos7-clang100-opt-no-rt-cxxmodules: /cvmfs/sft.cern.ch/lcg/views/LCG_rootext20180517/x86_64-centos7-gcc62-opt/include/Vc/scalar/../common/../sse/../common/bitscanintrinsics.h:44:13: warning: '_bit_scan_reverse' macro redefined [-Wmacro-redefined]
master-x86_64-centos7-clang100-opt-no-rt-cxxmodules: /cvmfs/sft.cern.ch/lcg/views/LCG_rootext20180517/x86_64-centos7-gcc62-opt/include/Vc/scalar/../common/../sse/../common/bitscanintrinsics.h:44:13: warning: '_bit_scan_reverse' macro redefined [-Wmacro-redefined]
master-x86_64-centos7-clang100-opt-no-rt-cxxmodules: /cvmfs/sft.cern.ch/lcg/views/LCG_rootext20180517/x86_64-centos7-gcc62-opt/include/Vc/scalar/../common/../sse/../common/bitscanintrinsics.h:44:13: warning: '_bit_scan_reverse' macro redefined [-Wmacro-redefined]
master-x86_64-centos7-clang100-opt-no-rt-cxxmodules: /cvmfs/sft.cern.ch/lcg/views/LCG_rootext20180517/x86_64-centos7-gcc62-opt/include/Vc/scalar/../common/../sse/../common/bitscanintrinsics.h:44:13: warning: '_bit_scan_reverse' macro redefined [-Wmacro-redefined]
master-x86_64-centos7-clang100-opt-no-rt-cxxmodules: /cvmfs/sft.cern.ch/lcg/views/LCG_rootext20180517/x86_64-centos7-gcc62-opt/include/Vc/scalar/../common/../sse/../common/bitscanintrinsics.h:44:13: warning: '_bit_scan_reverse' macro redefined [-Wmacro-redefined]
master-x86_64-centos7-clang100-opt-no-rt-cxxmodules: /cvmfs/sft.cern.ch/lcg/views/LCG_rootext20180517/x86_64-centos7-gcc62-opt/include/Vc/scalar/../common/../sse/../common/bitscanintrinsics.h:44:13: warning: '_bit_scan_reverse' macro redefined [-Wmacro-redefined]

/cvmfs/sft.cern.ch/lcg/views/LCG_rootext20180517/x86_64-centos7-gcc62-opt/include/Vc/common/memorybase.h

Warnings:

master-x86_64-centos7-clang100-opt-cxxmodules: /cvmfs/sft.cern.ch/lcg/views/LCG_rootext20180517/x86_64-centos7-gcc62-opt/lib/cmake/VecCore/../../../include/Vc/scalar/../common/memorybase.h:463:83: warning: unused parameter 'flags' [-Wunused-parameter]
master-x86_64-centos7-clang100-opt-cxxmodules: /cvmfs/sft.cern.ch/lcg/views/LCG_rootext20180517/x86_64-centos7-gcc62-opt/lib/cmake/VecCore/../../../include/Vc/scalar/../common/memorybase.h:463:83: warning: unused parameter 'flags' [-Wunused-parameter]
master-x86_64-centos7-clang100-opt-cxxmodules: /cvmfs/sft.cern.ch/lcg/views/LCG_rootext20180517/x86_64-centos7-gcc62-opt/lib/cmake/VecCore/../../../include/Vc/scalar/../common/memorybase.h:478:89: warning: unused parameter 'flags' [-Wunused-parameter]
master-x86_64-centos7-clang100-opt-cxxmodules: /cvmfs/sft.cern.ch/lcg/views/LCG_rootext20180517/x86_64-centos7-gcc62-opt/lib/cmake/VecCore/../../../include/Vc/scalar/../common/memorybase.h:478:89: warning: unused parameter 'flags' [-Wunused-parameter]

/cvmfs/sft.cern.ch/lcg/views/LCG_rootext20180517/x86_64-centos7-gcc62-opt/include/Vc/sse/intrinsics.h

Warnings:

master-x86_64-centos7-clang100-opt-master: /cvmfs/sft.cern.ch/lcg/views/LCG_rootext20180517/x86_64-centos7-gcc62-opt/include/Vc/scalar/../common/../sse/intrinsics.h:590:16: note: initialize the variable 'f' to silence this warning
master-x86_64-centos7-clang100-opt-master: /cvmfs/sft.cern.ch/lcg/views/LCG_rootext20180517/x86_64-centos7-gcc62-opt/include/Vc/scalar/../common/../sse/intrinsics.h:590:16: note: initialize the variable 'f' to silence this warning
master-x86_64-centos7-clang100-opt-cxxmodules: /cvmfs/sft.cern.ch/lcg/views/LCG_rootext20180517/x86_64-centos7-gcc62-opt/lib/cmake/VecCore/../../../include/Vc/scalar/../common/../sse/intrinsics.h:590:16: note: initialize the variable 'f' to silence this warning
master-x86_64-centos7-clang100-opt-cxxmodules: /cvmfs/sft.cern.ch/lcg/views/LCG_rootext20180517/x86_64-centos7-gcc62-opt/lib/cmake/VecCore/../../../include/Vc/scalar/../common/../sse/intrinsics.h:590:16: note: initialize the variable 'f' to silence this warning
master-x86_64-centos7-clang100-opt-no-rt-cxxmodules: /cvmfs/sft.cern.ch/lcg/views/LCG_rootext20180517/x86_64-centos7-gcc62-opt/include/Vc/scalar/../common/../sse/intrinsics.h:590:16: note: initialize the variable 'f' to silence this warning
master-x86_64-centos7-clang100-opt-no-rt-cxxmodules: /cvmfs/sft.cern.ch/lcg/views/LCG_rootext20180517/x86_64-centos7-gcc62-opt/include/Vc/scalar/../common/../sse/intrinsics.h:590:16: note: initialize the variable 'f' to silence this warning
master-x86_64-centos7-clang100-opt-master: /cvmfs/sft.cern.ch/lcg/views/LCG_rootext20180517/x86_64-centos7-gcc62-opt/include/Vc/scalar/../common/../sse/intrinsics.h:616:16: warning: variable 'f' may be uninitialized when used here [-Wconditional-uninitialized]
master-x86_64-centos7-clang100-opt-master: /cvmfs/sft.cern.ch/lcg/views/LCG_rootext20180517/x86_64-centos7-gcc62-opt/include/Vc/scalar/../common/../sse/intrinsics.h:616:16: warning: variable 'f' may be uninitialized when used here [-Wconditional-uninitialized]
master-x86_64-centos7-clang100-opt-cxxmodules: /cvmfs/sft.cern.ch/lcg/views/LCG_rootext20180517/x86_64-centos7-gcc62-opt/lib/cmake/VecCore/../../../include/Vc/scalar/../common/../sse/intrinsics.h:616:16: warning: variable 'f' may be uninitialized when used here [-Wconditional-uninitialized]
master-x86_64-centos7-clang100-opt-cxxmodules: /cvmfs/sft.cern.ch/lcg/views/LCG_rootext20180517/x86_64-centos7-gcc62-opt/lib/cmake/VecCore/../../../include/Vc/scalar/../common/../sse/intrinsics.h:616:16: warning: variable 'f' may be uninitialized when used here [-Wconditional-uninitialized]
master-x86_64-centos7-clang100-opt-no-rt-cxxmodules: /cvmfs/sft.cern.ch/lcg/views/LCG_rootext20180517/x86_64-centos7-gcc62-opt/include/Vc/scalar/../common/../sse/intrinsics.h:616:16: warning: variable 'f' may be uninitialized when used here [-Wconditional-uninitialized]
master-x86_64-centos7-clang100-opt-no-rt-cxxmodules: /cvmfs/sft.cern.ch/lcg/views/LCG_rootext20180517/x86_64-centos7-gcc62-opt/include/Vc/scalar/../common/../sse/intrinsics.h:616:16: warning: variable 'f' may be uninitialized when used here [-Wconditional-uninitialized]

/usr/include/libio.h

Warnings:

master-x86_64-centos7-clang100-opt-cxxmodules: /usr/include/libio.h:435:12: note: '_IO_getc' declared here
master-x86_64-centos7-clang100-opt-cxxmodules: /usr/include/libio.h:436:12: note: '_IO_putc' declared here

core/base/inc/ROOT/RConfig.hxx

Warnings:

master-x86_64-mac1014-clang100-opt-exp-cxxmod: /.../root/core/base/inc/ROOT/RConfig.hxx:468:12: note: other definition of '_R__DEPRECATED_LATER'
master-x86_64-centos7-clang100-opt-cxxmodules: /.../root/core/base/inc/ROOT/RConfig.hxx:468:12: note: other definition of '_R__DEPRECATED_LATER'
master-x86_64-ubuntu18-clang91-opt: /.../root/core/base/inc/ROOT/RConfig.hxx:468:12: note: other definition of '_R__DEPRECATED_LATER'

core/base/inc/TStringLong.h

Warnings:

master-x86_64-mac1014-clang100-opt-exp-cxxmod: /.../root/core/base/inc/TStringLong.h:52:3: warning: ambiguous expansion of macro '_R__DEPRECATED_LATER' [-Wambiguous-macro]
master-x86_64-mac1014-clang100-opt-exp-cxxmod: /.../root/core/base/inc/TStringLong.h:52:3: note: 'TStringLong' has been explicitly marked deprecated here
master-x86_64-mac1014-clang100-opt-exp-cxxmod: /.../root/core/base/inc/TStringLong.h:52:3: note: 'TStringLong' has been explicitly marked deprecated here
master-x86_64-mac1014-clang100-opt-exp-cxxmod: /.../root/core/base/inc/TStringLong.h:52:3: note: 'TStringLong' has been explicitly marked deprecated here
master-x86_64-mac1014-clang100-opt-exp-cxxmod: /.../root/core/base/inc/TStringLong.h:52:3: note: 'TStringLong' has been explicitly marked deprecated here
master-x86_64-mac1014-clang100-opt-exp-cxxmod: /.../root/core/base/inc/TStringLong.h:52:3: note: 'TStringLong' has been explicitly marked deprecated here
master-x86_64-mac1014-clang100-opt-exp-cxxmod: /.../root/core/base/inc/TStringLong.h:52:3: note: 'TStringLong' has been explicitly marked deprecated here
master-x86_64-mac1014-clang100-opt-exp-cxxmod: /.../root/core/base/inc/TStringLong.h:52:3: note: 'TStringLong' has been explicitly marked deprecated here
master-x86_64-mac1014-clang100-opt-exp-cxxmod: /.../root/core/base/inc/TStringLong.h:52:3: note: 'TStringLong' has been explicitly marked deprecated here
master-x86_64-mac1014-clang100-opt-exp-cxxmod: /.../root/core/base/inc/TStringLong.h:52:3: note: 'TStringLong' has been explicitly marked deprecated here
master-x86_64-mac1014-clang100-opt-exp-cxxmod: /.../root/core/base/inc/TStringLong.h:52:3: note: 'TStringLong' has been explicitly marked deprecated here
master-x86_64-mac1014-clang100-opt-exp-cxxmod: /.../root/core/base/inc/TStringLong.h:52:3: note: 'TStringLong' has been explicitly marked deprecated here
master-x86_64-centos7-clang100-opt-cxxmodules: /.../root/core/base/inc/TStringLong.h:52:3: warning: ambiguous expansion of macro '_R__DEPRECATED_LATER' [-Wambiguous-macro]
master-x86_64-centos7-clang100-opt-cxxmodules: /.../root/core/base/inc/TStringLong.h:52:3: note: 'TStringLong' has been explicitly marked deprecated here
master-x86_64-centos7-clang100-opt-cxxmodules: /.../root/core/base/inc/TStringLong.h:52:3: note: 'TStringLong' has been explicitly marked deprecated here
master-x86_64-centos7-clang100-opt-cxxmodules: /.../root/core/base/inc/TStringLong.h:52:3: note: 'TStringLong' has been explicitly marked deprecated here
master-x86_64-centos7-clang100-opt-cxxmodules: /.../root/core/base/inc/TStringLong.h:52:3: note: 'TStringLong' has been explicitly marked deprecated here
master-x86_64-centos7-clang100-opt-cxxmodules: /.../root/core/base/inc/TStringLong.h:52:3: note: 'TStringLong' has been explicitly marked deprecated here
master-x86_64-centos7-clang100-opt-cxxmodules: /.../root/core/base/inc/TStringLong.h:52:3: note: 'TStringLong' has been explicitly marked deprecated here
master-x86_64-centos7-clang100-opt-cxxmodules: /.../root/core/base/inc/TStringLong.h:52:3: note: 'TStringLong' has been explicitly marked deprecated here
master-x86_64-centos7-clang100-opt-cxxmodules: /.../root/core/base/inc/TStringLong.h:52:3: note: 'TStringLong' has been explicitly marked deprecated here
master-x86_64-centos7-clang100-opt-cxxmodules: /.../root/core/base/inc/TStringLong.h:52:3: note: 'TStringLong' has been explicitly marked deprecated here
master-x86_64-centos7-clang100-opt-cxxmodules: /.../root/core/base/inc/TStringLong.h:52:3: note: 'TStringLong' has been explicitly marked deprecated here
master-x86_64-ubuntu18-clang91-opt: /.../root/core/base/inc/TStringLong.h:52:3: warning: ambiguous expansion of macro '_R__DEPRECATED_LATER' [-Wambiguous-macro]
master-x86_64-ubuntu18-clang91-opt: /.../root/core/base/inc/TStringLong.h:52:3: note: 'TStringLong' has been explicitly marked deprecated here
master-x86_64-ubuntu18-clang91-opt: /.../root/core/base/inc/TStringLong.h:52:3: note: 'TStringLong' has been explicitly marked deprecated here
master-x86_64-ubuntu18-clang91-opt: /.../root/core/base/inc/TStringLong.h:52:3: note: 'TStringLong' has been explicitly marked deprecated here
master-x86_64-ubuntu18-clang91-opt: /.../root/core/base/inc/TStringLong.h:52:3: note: 'TStringLong' has been explicitly marked deprecated here
master-x86_64-ubuntu18-clang91-opt: /.../root/core/base/inc/TStringLong.h:52:3: note: 'TStringLong' has been explicitly marked deprecated here
master-x86_64-ubuntu18-clang91-opt: /.../root/core/base/inc/TStringLong.h:52:3: note: 'TStringLong' has been explicitly marked deprecated here
master-x86_64-ubuntu18-clang91-opt: /.../root/core/base/inc/TStringLong.h:52:3: note: 'TStringLong' has been explicitly marked deprecated here
master-x86_64-ubuntu18-clang91-opt: /.../root/core/base/inc/TStringLong.h:52:3: note: 'TStringLong' has been explicitly marked deprecated here
master-x86_64-ubuntu18-clang91-opt: /.../root/core/base/inc/TStringLong.h:52:3: note: 'TStringLong' has been explicitly marked deprecated here
master-x86_64-ubuntu18-clang91-opt: /.../root/core/base/inc/TStringLong.h:52:3: note: 'TStringLong' has been explicitly marked deprecated here
master-x86_64-ubuntu18-clang91-opt: /.../root/core/base/inc/TStringLong.h:52:3: note: 'TStringLong' has been explicitly marked deprecated here

core/dictgen/src/rootcling_impl.cxx

Warnings:

master-x86_64-centos7-clang100-opt-cxxmodules: /.../root/core/dictgen/src/rootcling_impl.cxx:104:2: warning: missing submodule 'ROOT_Foundation_C.strlcpy.h' [-Wincomplete-umbrella]

core/G__Core.cxx

Warnings:

master-x86_64-mac1014-clang100-opt-exp-cxxmod: /.../build/core/G__Core.cxx:7960:64: warning: 'TStringLong' is deprecated: There is a superior alternative: TString [-Wdeprecated-declarations]
master-x86_64-mac1014-clang100-opt-exp-cxxmod: /.../build/core/G__Core.cxx:7962:9: warning: 'TStringLong' is deprecated: There is a superior alternative: TString [-Wdeprecated-declarations]
master-x86_64-mac1014-clang100-opt-exp-cxxmod: /.../build/core/G__Core.cxx:7963:77: warning: 'TStringLong' is deprecated: There is a superior alternative: TString [-Wdeprecated-declarations]
master-x86_64-mac1014-clang100-opt-exp-cxxmod: /.../build/core/G__Core.cxx:7965:47: warning: 'TStringLong' is deprecated: There is a superior alternative: TString [-Wdeprecated-declarations]
master-x86_64-mac1014-clang100-opt-exp-cxxmod: /.../build/core/G__Core.cxx:7966:28: warning: 'TStringLong' is deprecated: There is a superior alternative: TString [-Wdeprecated-declarations]
master-x86_64-mac1014-clang100-opt-exp-cxxmod: /.../build/core/G__Core.cxx:7967:33: warning: 'TStringLong' is deprecated: There is a superior alternative: TString [-Wdeprecated-declarations]
master-x86_64-mac1014-clang100-opt-exp-cxxmod: /.../build/core/G__Core.cxx:7968:28: warning: 'TStringLong' is deprecated: There is a superior alternative: TString [-Wdeprecated-declarations]
master-x86_64-mac1014-clang100-opt-exp-cxxmod: /.../build/core/G__Core.cxx:7977:52: warning: 'TStringLong' is deprecated: There is a superior alternative: TString [-Wdeprecated-declarations]
master-x86_64-mac1014-clang100-opt-exp-cxxmod: /.../build/core/G__Core.cxx:7979:43: warning: 'TStringLong' is deprecated: There is a superior alternative: TString [-Wdeprecated-declarations]
master-x86_64-mac1014-clang100-opt-exp-cxxmod: /.../build/core/G__Core.cxx:7982:98: warning: 'TStringLong' is deprecated: There is a superior alternative: TString [-Wdeprecated-declarations]
master-x86_64-centos7-clang100-opt-cxxmodules: /.../build/core/G__Core.cxx:7999:64: warning: 'TStringLong' is deprecated: There is a superior alternative: TString [-Wdeprecated-declarations]
master-x86_64-ubuntu18-clang91-opt: /.../build/core/G__Core.cxx:7999:64: warning: 'TStringLong' is deprecated: There is a superior alternative: TString [-Wdeprecated-declarations]
master-x86_64-centos7-clang100-opt-cxxmodules: /.../build/core/G__Core.cxx:8001:9: warning: 'TStringLong' is deprecated: There is a superior alternative: TString [-Wdeprecated-declarations]
master-x86_64-ubuntu18-clang91-opt: /.../build/core/G__Core.cxx:8001:9: warning: 'TStringLong' is deprecated: There is a superior alternative: TString [-Wdeprecated-declarations]
master-x86_64-centos7-clang100-opt-cxxmodules: /.../build/core/G__Core.cxx:8002:77: warning: 'TStringLong' is deprecated: There is a superior alternative: TString [-Wdeprecated-declarations]
master-x86_64-ubuntu18-clang91-opt: /.../build/core/G__Core.cxx:8002:77: warning: 'TStringLong' is deprecated: There is a superior alternative: TString [-Wdeprecated-declarations]
master-x86_64-centos7-clang100-opt-cxxmodules: /.../build/core/G__Core.cxx:8004:47: warning: 'TStringLong' is deprecated: There is a superior alternative: TString [-Wdeprecated-declarations]
master-x86_64-ubuntu18-clang91-opt: /.../build/core/G__Core.cxx:8004:47: warning: 'TStringLong' is deprecated: There is a superior alternative: TString [-Wdeprecated-declarations]
master-x86_64-centos7-clang100-opt-cxxmodules: /.../build/core/G__Core.cxx:8005:28: warning: 'TStringLong' is deprecated: There is a superior alternative: TString [-Wdeprecated-declarations]
master-x86_64-ubuntu18-clang91-opt: /.../build/core/G__Core.cxx:8005:28: warning: 'TStringLong' is deprecated: There is a superior alternative: TString [-Wdeprecated-declarations]
master-x86_64-centos7-clang100-opt-cxxmodules: /.../build/core/G__Core.cxx:8006:33: warning: 'TStringLong' is deprecated: There is a superior alternative: TString [-Wdeprecated-declarations]
master-x86_64-ubuntu18-clang91-opt: /.../build/core/G__Core.cxx:8006:33: warning: 'TStringLong' is deprecated: There is a superior alternative: TString [-Wdeprecated-declarations]
master-x86_64-centos7-clang100-opt-cxxmodules: /.../build/core/G__Core.cxx:8007:28: warning: 'TStringLong' is deprecated: There is a superior alternative: TString [-Wdeprecated-declarations]
master-x86_64-ubuntu18-clang91-opt: /.../build/core/G__Core.cxx:8007:28: warning: 'TStringLong' is deprecated: There is a superior alternative: TString [-Wdeprecated-declarations]
master-x86_64-centos7-clang100-opt-cxxmodules: /.../build/core/G__Core.cxx:8016:52: warning: 'TStringLong' is deprecated: There is a superior alternative: TString [-Wdeprecated-declarations]
master-x86_64-ubuntu18-clang91-opt: /.../build/core/G__Core.cxx:8016:52: warning: 'TStringLong' is deprecated: There is a superior alternative: TString [-Wdeprecated-declarations]
master-x86_64-centos7-clang100-opt-cxxmodules: /.../build/core/G__Core.cxx:8018:43: warning: 'TStringLong' is deprecated: There is a superior alternative: TString [-Wdeprecated-declarations]
master-x86_64-ubuntu18-clang91-opt: /.../build/core/G__Core.cxx:8018:43: warning: 'TStringLong' is deprecated: There is a superior alternative: TString [-Wdeprecated-declarations]
master-x86_64-centos7-clang100-opt-cxxmodules: /.../build/core/G__Core.cxx:8021:98: warning: 'TStringLong' is deprecated: There is a superior alternative: TString [-Wdeprecated-declarations]
master-x86_64-ubuntu18-clang91-opt: /.../build/core/G__Core.cxx:8021:98: warning: 'TStringLong' is deprecated: There is a superior alternative: TString [-Wdeprecated-declarations]
v6-18-00-patches-x86_64-ubuntu18-clang91-opt: /.../build/core/G__Core.cxx:8309:64: warning: 'TStringLong' is deprecated: There is a superior alternative: TString [-Wdeprecated-declarations]
v6-18-00-patches-x86_64-ubuntu18-clang91-opt: /.../build/core/G__Core.cxx:8311:9: warning: 'TStringLong' is deprecated: There is a superior alternative: TString [-Wdeprecated-declarations]
v6-18-00-patches-x86_64-ubuntu18-clang91-opt: /.../build/core/G__Core.cxx:8312:77: warning: 'TStringLong' is deprecated: There is a superior alternative: TString [-Wdeprecated-declarations]
v6-18-00-patches-x86_64-ubuntu18-clang91-opt: /.../build/core/G__Core.cxx:8314:47: warning: 'TStringLong' is deprecated: There is a superior alternative: TString [-Wdeprecated-declarations]
v6-18-00-patches-x86_64-ubuntu18-clang91-opt: /.../build/core/G__Core.cxx:8315:28: warning: 'TStringLong' is deprecated: There is a superior alternative: TString [-Wdeprecated-declarations]
v6-18-00-patches-x86_64-ubuntu18-clang91-opt: /.../build/core/G__Core.cxx:8316:33: warning: 'TStringLong' is deprecated: There is a superior alternative: TString [-Wdeprecated-declarations]
v6-18-00-patches-x86_64-ubuntu18-clang91-opt: /.../build/core/G__Core.cxx:8317:28: warning: 'TStringLong' is deprecated: There is a superior alternative: TString [-Wdeprecated-declarations]
v6-18-00-patches-x86_64-ubuntu18-clang91-opt: /.../build/core/G__Core.cxx:8326:52: warning: 'TStringLong' is deprecated: There is a superior alternative: TString [-Wdeprecated-declarations]
v6-18-00-patches-x86_64-ubuntu18-clang91-opt: /.../build/core/G__Core.cxx:8328:43: warning: 'TStringLong' is deprecated: There is a superior alternative: TString [-Wdeprecated-declarations]
v6-18-00-patches-x86_64-ubuntu18-clang91-opt: /.../build/core/G__Core.cxx:8331:98: warning: 'TStringLong' is deprecated: There is a superior alternative: TString [-Wdeprecated-declarations]
master-x86_64-mac1014-clang100-opt-exp-cxxmod: /.../build/core/G__Core.cxx:23842:28: warning: 'TStringLong' is deprecated: There is a superior alternative: TString [-Wdeprecated-declarations]
master-x86_64-mac1014-clang100-opt-exp-cxxmod: /.../build/core/G__Core.cxx:23842:48: warning: 'TStringLong' is deprecated: There is a superior alternative: TString [-Wdeprecated-declarations]
master-x86_64-ubuntu18-clang91-opt: /.../build/core/G__Core.cxx:23881:28: warning: 'TStringLong' is deprecated: There is a superior alternative: TString [-Wdeprecated-declarations]
v6-18-00-patches-x86_64-ubuntu18-clang91-opt: /.../build/core/G__Core.cxx:24184:28: warning: 'TStringLong' is deprecated: There is a superior alternative: TString [-Wdeprecated-declarations]
v6-18-00-patches-x86_64-ubuntu18-clang91-opt: /.../build/core/G__Core.cxx:24184:48: warning: 'TStringLong' is deprecated: There is a superior alternative: TString [-Wdeprecated-declarations]
v6-18-00-patches-x86_64-ubuntu18-clang91-opt: /.../build/core/G__Core.cxx:24187:27: warning: 'TStringLong' is deprecated: There is a superior alternative: TString [-Wdeprecated-declarations]

core/metacling/src/TClingCallFunc.cxx

Warnings:

master-x86_64-centos7-clang100-opt-cxxmodules: /.../root/core/metacling/src/TClingCallFunc.cxx:56:2: warning: missing submodule 'LLVM_ExecutionEngine.ExecutionEngine' [-Wincomplete-umbrella]
master-x86_64-ubuntu18-clang91-opt: /.../root/core/metacling/src/TClingCallFunc.cxx:56:2: warning: missing submodule 'LLVM_ExecutionEngine.ExecutionEngine' [-Wincomplete-umbrella]
master-x86_64-centos7-clang100-opt-cxxmodules: /.../root/core/metacling/src/TClingCallFunc.cxx:57:2: warning: missing submodule 'LLVM_ExecutionEngine.GenericValue' [-Wincomplete-umbrella]
master-x86_64-ubuntu18-clang91-opt: /.../root/core/metacling/src/TClingCallFunc.cxx:57:2: warning: missing submodule 'LLVM_ExecutionEngine.GenericValue' [-Wincomplete-umbrella]

core/metacling/src/TClingRdictModuleFileExtension.cxx

Warnings:

master-x86_64-centos7-clang100-opt-cxxmodules: /.../root/core/metacling/src/TClingRdictModuleFileExtension.cxx:22:2: warning: missing submodule 'Clang_Diagnostics.Frontend' [-Wincomplete-umbrella]

core/metacling/src/TClingTypedefInfo.cxx

Errors:

master-x86_64-centos7-clang100-opt-cxxmodules: /.../root/core/metacling/src/TClingTypedefInfo.cxx:31:10: fatal error: could not build module 'Cling_Utils'

include/Math/Types.h

Errors:

master-x86_64-centos7-clang100-opt-no-rt-cxxmodules: In file included from note/.../build/include/Math/Types.h:18: :

include/ROOT/RConfig.hxx

Warnings:

v6-18-00-patches-x86_64-ubuntu18-clang91-opt: /.../build/include/ROOT/RConfig.hxx:470:56: note: expanded from macro '_R__DEPRECATED_LATER'
v6-18-00-patches-x86_64-ubuntu18-clang91-opt: /.../build/include/ROOT/RConfig.hxx:470:56: note: expanded from macro '_R__DEPRECATED_LATER'
v6-18-00-patches-x86_64-ubuntu18-clang91-opt: /.../build/include/ROOT/RConfig.hxx:470:56: note: expanded from macro '_R__DEPRECATED_LATER'
v6-18-00-patches-x86_64-ubuntu18-clang91-opt: /.../build/include/ROOT/RConfig.hxx:470:56: note: expanded from macro '_R__DEPRECATED_LATER'
v6-18-00-patches-x86_64-ubuntu18-clang91-opt: /.../build/include/ROOT/RConfig.hxx:470:56: note: expanded from macro '_R__DEPRECATED_LATER'
v6-18-00-patches-x86_64-ubuntu18-clang91-opt: /.../build/include/ROOT/RConfig.hxx:470:56: note: expanded from macro '_R__DEPRECATED_LATER'
v6-18-00-patches-x86_64-ubuntu18-clang91-opt: /.../build/include/ROOT/RConfig.hxx:470:56: note: expanded from macro '_R__DEPRECATED_LATER'
v6-18-00-patches-x86_64-ubuntu18-clang91-opt: /.../build/include/ROOT/RConfig.hxx:470:56: note: expanded from macro '_R__DEPRECATED_LATER'
v6-18-00-patches-x86_64-ubuntu18-clang91-opt: /.../build/include/ROOT/RConfig.hxx:470:56: note: expanded from macro '_R__DEPRECATED_LATER'
v6-18-00-patches-x86_64-ubuntu18-clang91-opt: /.../build/include/ROOT/RConfig.hxx:470:56: note: expanded from macro '_R__DEPRECATED_LATER'
v6-18-00-patches-x86_64-ubuntu18-clang91-opt: /.../build/include/ROOT/RConfig.hxx:470:56: note: expanded from macro '_R__DEPRECATED_LATER'
v6-18-00-patches-x86_64-ubuntu18-clang91-opt: /.../build/include/ROOT/RConfig.hxx:470:56: note: expanded from macro '_R__DEPRECATED_LATER'
master-x86_64-mac1014-clang100-opt-exp-cxxmod: /.../build/include/ROOT/RConfig.hxx:470:12: note: expanding this definition of '_R__DEPRECATED_LATER'
master-x86_64-mac1014-clang100-opt-exp-cxxmod: /.../build/include/ROOT/RConfig.hxx:470:56: note: expanded from macro '_R__DEPRECATED_LATER'
master-x86_64-mac1014-clang100-opt-exp-cxxmod: /.../build/include/ROOT/RConfig.hxx:470:56: note: expanded from macro '_R__DEPRECATED_LATER'
master-x86_64-mac1014-clang100-opt-exp-cxxmod: /.../build/include/ROOT/RConfig.hxx:470:56: note: expanded from macro '_R__DEPRECATED_LATER'
master-x86_64-mac1014-clang100-opt-exp-cxxmod: /.../build/include/ROOT/RConfig.hxx:470:56: note: expanded from macro '_R__DEPRECATED_LATER'
master-x86_64-mac1014-clang100-opt-exp-cxxmod: /.../build/include/ROOT/RConfig.hxx:470:56: note: expanded from macro '_R__DEPRECATED_LATER'
master-x86_64-mac1014-clang100-opt-exp-cxxmod: /.../build/include/ROOT/RConfig.hxx:470:56: note: expanded from macro '_R__DEPRECATED_LATER'
master-x86_64-mac1014-clang100-opt-exp-cxxmod: /.../build/include/ROOT/RConfig.hxx:470:56: note: expanded from macro '_R__DEPRECATED_LATER'
master-x86_64-mac1014-clang100-opt-exp-cxxmod: /.../build/include/ROOT/RConfig.hxx:470:56: note: expanded from macro '_R__DEPRECATED_LATER'
master-x86_64-mac1014-clang100-opt-exp-cxxmod: /.../build/include/ROOT/RConfig.hxx:470:56: note: expanded from macro '_R__DEPRECATED_LATER'
master-x86_64-mac1014-clang100-opt-exp-cxxmod: /.../build/include/ROOT/RConfig.hxx:470:56: note: expanded from macro '_R__DEPRECATED_LATER'
master-x86_64-mac1014-clang100-opt-exp-cxxmod: /.../build/include/ROOT/RConfig.hxx:470:56: note: expanded from macro '_R__DEPRECATED_LATER'
master-x86_64-centos7-clang100-opt-cxxmodules: /.../build/include/ROOT/RConfig.hxx:470:12: note: expanding this definition of '_R__DEPRECATED_LATER'
master-x86_64-centos7-clang100-opt-cxxmodules: /.../build/include/ROOT/RConfig.hxx:470:56: note: expanded from macro '_R__DEPRECATED_LATER'
master-x86_64-centos7-clang100-opt-cxxmodules: /.../build/include/ROOT/RConfig.hxx:470:56: note: expanded from macro '_R__DEPRECATED_LATER'
master-x86_64-centos7-clang100-opt-cxxmodules: /.../build/include/ROOT/RConfig.hxx:470:56: note: expanded from macro '_R__DEPRECATED_LATER'
master-x86_64-centos7-clang100-opt-cxxmodules: /.../build/include/ROOT/RConfig.hxx:470:56: note: expanded from macro '_R__DEPRECATED_LATER'
master-x86_64-centos7-clang100-opt-cxxmodules: /.../build/include/ROOT/RConfig.hxx:470:56: note: expanded from macro '_R__DEPRECATED_LATER'
master-x86_64-centos7-clang100-opt-cxxmodules: /.../build/include/ROOT/RConfig.hxx:470:56: note: expanded from macro '_R__DEPRECATED_LATER'
master-x86_64-centos7-clang100-opt-cxxmodules: /.../build/include/ROOT/RConfig.hxx:470:56: note: expanded from macro '_R__DEPRECATED_LATER'
master-x86_64-centos7-clang100-opt-cxxmodules: /.../build/include/ROOT/RConfig.hxx:470:56: note: expanded from macro '_R__DEPRECATED_LATER'
master-x86_64-centos7-clang100-opt-cxxmodules: /.../build/include/ROOT/RConfig.hxx:470:56: note: expanded from macro '_R__DEPRECATED_LATER'
master-x86_64-ubuntu18-clang91-opt: /.../build/include/ROOT/RConfig.hxx:470:12: note: expanding this definition of '_R__DEPRECATED_LATER'
master-x86_64-ubuntu18-clang91-opt: /.../build/include/ROOT/RConfig.hxx:470:56: note: expanded from macro '_R__DEPRECATED_LATER'
master-x86_64-ubuntu18-clang91-opt: /.../build/include/ROOT/RConfig.hxx:470:56: note: expanded from macro '_R__DEPRECATED_LATER'
master-x86_64-ubuntu18-clang91-opt: /.../build/include/ROOT/RConfig.hxx:470:56: note: expanded from macro '_R__DEPRECATED_LATER'
master-x86_64-ubuntu18-clang91-opt: /.../build/include/ROOT/RConfig.hxx:470:56: note: expanded from macro '_R__DEPRECATED_LATER'
master-x86_64-ubuntu18-clang91-opt: /.../build/include/ROOT/RConfig.hxx:470:56: note: expanded from macro '_R__DEPRECATED_LATER'
master-x86_64-ubuntu18-clang91-opt: /.../build/include/ROOT/RConfig.hxx:470:56: note: expanded from macro '_R__DEPRECATED_LATER'
master-x86_64-ubuntu18-clang91-opt: /.../build/include/ROOT/RConfig.hxx:470:56: note: expanded from macro '_R__DEPRECATED_LATER'
master-x86_64-ubuntu18-clang91-opt: /.../build/include/ROOT/RConfig.hxx:470:56: note: expanded from macro '_R__DEPRECATED_LATER'
master-x86_64-ubuntu18-clang91-opt: /.../build/include/ROOT/RConfig.hxx:470:56: note: expanded from macro '_R__DEPRECATED_LATER'
master-x86_64-ubuntu18-clang91-opt: /.../build/include/ROOT/RConfig.hxx:470:56: note: expanded from macro '_R__DEPRECATED_LATER'
master-x86_64-ubuntu18-clang91-opt: /.../build/include/ROOT/RConfig.hxx:470:56: note: expanded from macro '_R__DEPRECATED_LATER'
v6-18-00-patches-x86_64-ubuntu18-clang91-opt: /.../build/include/ROOT/RConfig.hxx:534:5: note: expanded from macro 'R__ALWAYS_SUGGEST_ALTERNATIVE'
v6-18-00-patches-x86_64-ubuntu18-clang91-opt: /.../build/include/ROOT/RConfig.hxx:534:5: note: expanded from macro 'R__ALWAYS_SUGGEST_ALTERNATIVE'
v6-18-00-patches-x86_64-ubuntu18-clang91-opt: /.../build/include/ROOT/RConfig.hxx:534:5: note: expanded from macro 'R__ALWAYS_SUGGEST_ALTERNATIVE'
v6-18-00-patches-x86_64-ubuntu18-clang91-opt: /.../build/include/ROOT/RConfig.hxx:534:5: note: expanded from macro 'R__ALWAYS_SUGGEST_ALTERNATIVE'
v6-18-00-patches-x86_64-ubuntu18-clang91-opt: /.../build/include/ROOT/RConfig.hxx:534:5: note: expanded from macro 'R__ALWAYS_SUGGEST_ALTERNATIVE'
v6-18-00-patches-x86_64-ubuntu18-clang91-opt: /.../build/include/ROOT/RConfig.hxx:534:5: note: expanded from macro 'R__ALWAYS_SUGGEST_ALTERNATIVE'
v6-18-00-patches-x86_64-ubuntu18-clang91-opt: /.../build/include/ROOT/RConfig.hxx:534:5: note: expanded from macro 'R__ALWAYS_SUGGEST_ALTERNATIVE'
v6-18-00-patches-x86_64-ubuntu18-clang91-opt: /.../build/include/ROOT/RConfig.hxx:534:5: note: expanded from macro 'R__ALWAYS_SUGGEST_ALTERNATIVE'
v6-18-00-patches-x86_64-ubuntu18-clang91-opt: /.../build/include/ROOT/RConfig.hxx:534:5: note: expanded from macro 'R__ALWAYS_SUGGEST_ALTERNATIVE'
v6-18-00-patches-x86_64-ubuntu18-clang91-opt: /.../build/include/ROOT/RConfig.hxx:534:5: note: expanded from macro 'R__ALWAYS_SUGGEST_ALTERNATIVE'
v6-18-00-patches-x86_64-ubuntu18-clang91-opt: /.../build/include/ROOT/RConfig.hxx:534:5: note: expanded from macro 'R__ALWAYS_SUGGEST_ALTERNATIVE'
v6-18-00-patches-x86_64-ubuntu18-clang91-opt: /.../build/include/ROOT/RConfig.hxx:534:5: note: expanded from macro 'R__ALWAYS_SUGGEST_ALTERNATIVE'
master-x86_64-mac1014-clang100-opt-exp-cxxmod: /.../build/include/ROOT/RConfig.hxx:541:5: note: expanded from macro 'R__ALWAYS_SUGGEST_ALTERNATIVE'
master-x86_64-mac1014-clang100-opt-exp-cxxmod: /.../build/include/ROOT/RConfig.hxx:541:5: note: expanded from macro 'R__ALWAYS_SUGGEST_ALTERNATIVE'
master-x86_64-mac1014-clang100-opt-exp-cxxmod: /.../build/include/ROOT/RConfig.hxx:541:5: note: expanded from macro 'R__ALWAYS_SUGGEST_ALTERNATIVE'
master-x86_64-mac1014-clang100-opt-exp-cxxmod: /.../build/include/ROOT/RConfig.hxx:541:5: note: expanded from macro 'R__ALWAYS_SUGGEST_ALTERNATIVE'
master-x86_64-mac1014-clang100-opt-exp-cxxmod: /.../build/include/ROOT/RConfig.hxx:541:5: note: expanded from macro 'R__ALWAYS_SUGGEST_ALTERNATIVE'
master-x86_64-mac1014-clang100-opt-exp-cxxmod: /.../build/include/ROOT/RConfig.hxx:541:5: note: expanded from macro 'R__ALWAYS_SUGGEST_ALTERNATIVE'
master-x86_64-mac1014-clang100-opt-exp-cxxmod: /.../build/include/ROOT/RConfig.hxx:541:5: note: expanded from macro 'R__ALWAYS_SUGGEST_ALTERNATIVE'
master-x86_64-mac1014-clang100-opt-exp-cxxmod: /.../build/include/ROOT/RConfig.hxx:541:5: note: expanded from macro 'R__ALWAYS_SUGGEST_ALTERNATIVE'
master-x86_64-mac1014-clang100-opt-exp-cxxmod: /.../build/include/ROOT/RConfig.hxx:541:5: note: expanded from macro 'R__ALWAYS_SUGGEST_ALTERNATIVE'
master-x86_64-mac1014-clang100-opt-exp-cxxmod: /.../build/include/ROOT/RConfig.hxx:541:5: note: expanded from macro 'R__ALWAYS_SUGGEST_ALTERNATIVE'
master-x86_64-mac1014-clang100-opt-exp-cxxmod: /.../build/include/ROOT/RConfig.hxx:541:5: note: expanded from macro 'R__ALWAYS_SUGGEST_ALTERNATIVE'
master-x86_64-mac1014-clang100-opt-exp-cxxmod: /.../build/include/ROOT/RConfig.hxx:541:5: note: expanded from macro 'R__ALWAYS_SUGGEST_ALTERNATIVE'
master-x86_64-centos7-clang100-opt-cxxmodules: /.../build/include/ROOT/RConfig.hxx:541:5: note: expanded from macro 'R__ALWAYS_SUGGEST_ALTERNATIVE'
master-x86_64-centos7-clang100-opt-cxxmodules: /.../build/include/ROOT/RConfig.hxx:541:5: note: expanded from macro 'R__ALWAYS_SUGGEST_ALTERNATIVE'
master-x86_64-centos7-clang100-opt-cxxmodules: /.../build/include/ROOT/RConfig.hxx:541:5: note: expanded from macro 'R__ALWAYS_SUGGEST_ALTERNATIVE'
master-x86_64-centos7-clang100-opt-cxxmodules: /.../build/include/ROOT/RConfig.hxx:541:5: note: expanded from macro 'R__ALWAYS_SUGGEST_ALTERNATIVE'
master-x86_64-centos7-clang100-opt-cxxmodules: /.../build/include/ROOT/RConfig.hxx:541:5: note: expanded from macro 'R__ALWAYS_SUGGEST_ALTERNATIVE'
master-x86_64-centos7-clang100-opt-cxxmodules: /.../build/include/ROOT/RConfig.hxx:541:5: note: expanded from macro 'R__ALWAYS_SUGGEST_ALTERNATIVE'
master-x86_64-centos7-clang100-opt-cxxmodules: /.../build/include/ROOT/RConfig.hxx:541:5: note: expanded from macro 'R__ALWAYS_SUGGEST_ALTERNATIVE'
master-x86_64-centos7-clang100-opt-cxxmodules: /.../build/include/ROOT/RConfig.hxx:541:5: note: expanded from macro 'R__ALWAYS_SUGGEST_ALTERNATIVE'
master-x86_64-centos7-clang100-opt-cxxmodules: /.../build/include/ROOT/RConfig.hxx:541:5: note: expanded from macro 'R__ALWAYS_SUGGEST_ALTERNATIVE'
master-x86_64-centos7-clang100-opt-cxxmodules: /.../build/include/ROOT/RConfig.hxx:541:5: note: expanded from macro 'R__ALWAYS_SUGGEST_ALTERNATIVE'
master-x86_64-ubuntu18-clang91-opt: /.../build/include/ROOT/RConfig.hxx:541:5: note: expanded from macro 'R__ALWAYS_SUGGEST_ALTERNATIVE'
master-x86_64-ubuntu18-clang91-opt: /.../build/include/ROOT/RConfig.hxx:541:5: note: expanded from macro 'R__ALWAYS_SUGGEST_ALTERNATIVE'
master-x86_64-ubuntu18-clang91-opt: /.../build/include/ROOT/RConfig.hxx:541:5: note: expanded from macro 'R__ALWAYS_SUGGEST_ALTERNATIVE'
master-x86_64-ubuntu18-clang91-opt: /.../build/include/ROOT/RConfig.hxx:541:5: note: expanded from macro 'R__ALWAYS_SUGGEST_ALTERNATIVE'
master-x86_64-ubuntu18-clang91-opt: /.../build/include/ROOT/RConfig.hxx:541:5: note: expanded from macro 'R__ALWAYS_SUGGEST_ALTERNATIVE'
master-x86_64-ubuntu18-clang91-opt: /.../build/include/ROOT/RConfig.hxx:541:5: note: expanded from macro 'R__ALWAYS_SUGGEST_ALTERNATIVE'
master-x86_64-ubuntu18-clang91-opt: /.../build/include/ROOT/RConfig.hxx:541:5: note: expanded from macro 'R__ALWAYS_SUGGEST_ALTERNATIVE'
master-x86_64-ubuntu18-clang91-opt: /.../build/include/ROOT/RConfig.hxx:541:5: note: expanded from macro 'R__ALWAYS_SUGGEST_ALTERNATIVE'
master-x86_64-ubuntu18-clang91-opt: /.../build/include/ROOT/RConfig.hxx:541:5: note: expanded from macro 'R__ALWAYS_SUGGEST_ALTERNATIVE'
master-x86_64-ubuntu18-clang91-opt: /.../build/include/ROOT/RConfig.hxx:541:5: note: expanded from macro 'R__ALWAYS_SUGGEST_ALTERNATIVE'
master-x86_64-ubuntu18-clang91-opt: /.../build/include/ROOT/RConfig.hxx:541:5: note: expanded from macro 'R__ALWAYS_SUGGEST_ALTERNATIVE'
master-x86_64-ubuntu18-clang91-opt: /.../build/include/ROOT/RConfig.hxx:541:5: note: expanded from macro 'R__ALWAYS_SUGGEST_ALTERNATIVE'

include/TStringLong.h

Warnings:

v6-18-00-patches-x86_64-ubuntu18-clang91-opt: /.../build/include/TStringLong.h:52:3: note: 'TStringLong' has been explicitly marked deprecated here
v6-18-00-patches-x86_64-ubuntu18-clang91-opt: /.../build/include/TStringLong.h:52:3: note: 'TStringLong' has been explicitly marked deprecated here
v6-18-00-patches-x86_64-ubuntu18-clang91-opt: /.../build/include/TStringLong.h:52:3: note: 'TStringLong' has been explicitly marked deprecated here
v6-18-00-patches-x86_64-ubuntu18-clang91-opt: /.../build/include/TStringLong.h:52:3: note: 'TStringLong' has been explicitly marked deprecated here
v6-18-00-patches-x86_64-ubuntu18-clang91-opt: /.../build/include/TStringLong.h:52:3: note: 'TStringLong' has been explicitly marked deprecated here
v6-18-00-patches-x86_64-ubuntu18-clang91-opt: /.../build/include/TStringLong.h:52:3: note: 'TStringLong' has been explicitly marked deprecated here
v6-18-00-patches-x86_64-ubuntu18-clang91-opt: /.../build/include/TStringLong.h:52:3: note: 'TStringLong' has been explicitly marked deprecated here
v6-18-00-patches-x86_64-ubuntu18-clang91-opt: /.../build/include/TStringLong.h:52:3: note: 'TStringLong' has been explicitly marked deprecated here
v6-18-00-patches-x86_64-ubuntu18-clang91-opt: /.../build/include/TStringLong.h:52:3: note: 'TStringLong' has been explicitly marked deprecated here
v6-18-00-patches-x86_64-ubuntu18-clang91-opt: /.../build/include/TStringLong.h:52:3: note: 'TStringLong' has been explicitly marked deprecated here
v6-18-00-patches-x86_64-ubuntu18-clang91-opt: /.../build/include/TStringLong.h:52:3: note: 'TStringLong' has been explicitly marked deprecated here
v6-18-00-patches-x86_64-ubuntu18-clang91-opt: /.../build/include/TStringLong.h:52:3: note: 'TStringLong' has been explicitly marked deprecated here
v6-18-00-patches-x86_64-ubuntu18-clang91-opt: /.../build/include/TStringLong.h:52:3: note: 'TStringLong' has been explicitly marked deprecated here

interpreter/cling/include/cling/Utils/ParserStateRAII.h

Errors:

master-x86_64-centos7-clang100-opt-cxxmodules: /.../root/interpreter/cling/include/cling/Utils/ParserStateRAII.h:14:2: fatal error: module file '/.../build/include/pcms/1UIHRLRZYAO7L/Clang_AST-VV5FUAEWSEAJ.pcm' is out of date and needs to be rebuilt: signature mismatch

Warnings:

master-x86_64-centos7-clang100-opt-cxxmodules: /.../root/interpreter/cling/include/cling/Utils/ParserStateRAII.h:14:2: note: imported by module 'Clang_Parse' in '/.../build/include/pcms/1UIHRLRZYAO7L/Clang_Parse-VV5FUAEWSEAJ.pcm'

interpreter/llvm/src/include/llvm/ADT/Hashing.h

Warnings:

v6-18-00-patches-x86-winxp-vc16-opt: C:\build\night\LABEL\windows10\SPEC\default\V\6-18\root\interpreter\llvm\src\include\llvm\ADT\Hashing.h(393): warning C4789: buffer 'helper' of size 128 bytes will be overrun; -52 bytes will be written starting at offset 0 [C:\build\night\LABEL\windows10\SPEC\default\V\6-18\build\interpreter\llvm\src\tools\clang\lib\Serialization\clangSerialization.vcxproj]
v6-18-00-patches-x86-winxp-vc16-opt: C:\build\night\LABEL\windows10\SPEC\default\V\6-18\root\interpreter\llvm\src\include\llvm\ADT\Hashing.h(393): warning C4789: buffer 'helper' of size 128 bytes will be overrun; -52 bytes will be written starting at offset 0 [C:\build\night\LABEL\windows10\SPEC\default\V\6-18\build\interpreter\llvm\src\tools\clang\lib\Serialization\clangSerialization.vcxproj]
master-x86-winxp-vc16: C:\build\night\LABEL\windows10\SPEC\default\V\master\root\interpreter\llvm\src\include\llvm\ADT\Hashing.h(393): warning C4789: buffer 'helper' of size 128 bytes will be overrun; -52 bytes will be written starting at offset 0 [C:\build\night\LABEL\windows10\SPEC\default\V\master\build\interpreter\llvm\src\tools\clang\lib\Serialization\clangSerialization.vcxproj]
master-x86-winxp-vc16: C:\build\night\LABEL\windows10\SPEC\default\V\master\root\interpreter\llvm\src\include\llvm\ADT\Hashing.h(393): warning C4789: buffer 'helper' of size 128 bytes will be overrun; -52 bytes will be written starting at offset 0 [C:\build\night\LABEL\windows10\SPEC\default\V\master\build\interpreter\llvm\src\tools\clang\lib\Serialization\clangSerialization.vcxproj]

root/hist/hist/TFormulaBenchmarks.cxx

Warnings:

master-x86_64-centos7-clang100-opt-cxxmodules: /.../rootbench/root/hist/hist/TFormulaBenchmarks.cxx:29:21: warning: empty parentheses interpreted as a function declaration [-Wvexing-parse]
master-x86_64-centos7-clang100-opt-cxxmodules: /.../rootbench/root/hist/hist/TFormulaBenchmarks.cxx:29:21: note: replace parentheses with an initializer to declare a variable

root/math/mathcore/TMathBenchmarks.cxx

Warnings:

master-x86_64-centos7-gcc62-opt-master: /.../rootbench/root/math/mathcore/TMathBenchmarks.cxx:20:16: warning: variable ‘output_array’ set but not used [-Wunused-but-set-variable]
master-x86_64-centos7-gcc62-opt-master: /.../rootbench/root/math/mathcore/TMathBenchmarks.cxx:20:16: warning: variable ‘output_array’ set but not used [-Wunused-but-set-variable]
master-x86_64-centos7-gcc62-opt-master: /.../rootbench/root/math/mathcore/TMathBenchmarks.cxx:20:16: warning: variable ‘output_array’ set but not used [-Wunused-but-set-variable]
master-x86_64-centos7-gcc62-opt-master: /.../rootbench/root/math/mathcore/TMathBenchmarks.cxx:20:16: warning: variable ‘output_array’ set but not used [-Wunused-but-set-variable]
master-x86_64-centos7-gcc62-opt-master: /.../rootbench/root/math/mathcore/TMathBenchmarks.cxx:20:16: warning: variable ‘output_array’ set but not used [-Wunused-but-set-variable]
master-x86_64-centos7-gcc62-opt-master: /.../rootbench/root/math/mathcore/TMathBenchmarks.cxx:20:16: warning: variable ‘output_array’ set but not used [-Wunused-but-set-variable]
master-x86_64-centos7-gcc62-opt-master: /.../rootbench/root/math/mathcore/TMathBenchmarks.cxx:20:16: warning: variable ‘output_array’ set but not used [-Wunused-but-set-variable]
master-x86_64-centos7-gcc62-opt-master: /.../rootbench/root/math/mathcore/TMathBenchmarks.cxx:20:16: warning: variable ‘output_array’ set but not used [-Wunused-but-set-variable]
master-x86_64-centos7-gcc62-opt-master: /.../rootbench/root/math/mathcore/TMathBenchmarks.cxx:20:16: warning: variable ‘output_array’ set but not used [-Wunused-but-set-variable]
master-x86_64-centos7-gcc62-opt-master: /.../rootbench/root/math/mathcore/TMathBenchmarks.cxx:20:16: warning: variable ‘output_array’ set but not used [-Wunused-but-set-variable]
master-x86_64-centos7-gcc62-opt-master: /.../rootbench/root/math/mathcore/TMathBenchmarks.cxx:20:16: warning: variable ‘output_array’ set but not used [-Wunused-but-set-variable]
master-x86_64-centos7-gcc62-opt-master: /.../rootbench/root/math/mathcore/TMathBenchmarks.cxx:20:16: warning: variable ‘output_array’ set but not used [-Wunused-but-set-variable]
master-x86_64-centos7-gcc62-opt-master: /.../rootbench/root/math/mathcore/TMathBenchmarks.cxx:20:16: warning: variable ‘output_array’ set but not used [-Wunused-but-set-variable]
master-x86_64-centos7-gcc62-opt-master: /.../rootbench/root/math/mathcore/TMathBenchmarks.cxx:20:16: warning: variable ‘output_array’ set but not used [-Wunused-but-set-variable]
master-x86_64-centos7-gcc62-opt-master: /.../rootbench/root/math/mathcore/TMathBenchmarks.cxx:20:16: warning: variable ‘output_array’ set but not used [-Wunused-but-set-variable]
master-x86_64-centos7-gcc62-opt-master: /.../rootbench/root/math/mathcore/TMathBenchmarks.cxx:20:16: warning: variable ‘output_array’ set but not used [-Wunused-but-set-variable]
master-x86_64-centos7-gcc62-opt-master: /.../rootbench/root/math/mathcore/TMathBenchmarks.cxx:20:16: warning: variable ‘output_array’ set but not used [-Wunused-but-set-variable]
master-x86_64-centos7-gcc62-opt-master: /.../rootbench/root/math/mathcore/TMathBenchmarks.cxx:20:16: warning: variable ‘output_array’ set but not used [-Wunused-but-set-variable]
master-x86_64-centos7-gcc62-opt-master: /.../rootbench/root/math/mathcore/TMathBenchmarks.cxx:20:16: warning: variable ‘output_array’ set but not used [-Wunused-but-set-variable]
master-x86_64-centos7-gcc62-opt-master: /.../rootbench/root/math/mathcore/TMathBenchmarks.cxx:20:16: warning: variable ‘output_array’ set but not used [-Wunused-but-set-variable]
master-x86_64-centos7-gcc62-opt-no-rt-cxxmodules: /.../rootbench/root/math/mathcore/TMathBenchmarks.cxx:20:16: warning: variable ‘output_array’ set but not used [-Wunused-but-set-variable]
master-x86_64-centos7-gcc62-opt-no-rt-cxxmodules: /.../rootbench/root/math/mathcore/TMathBenchmarks.cxx:20:16: warning: variable ‘output_array’ set but not used [-Wunused-but-set-variable]
master-x86_64-centos7-gcc62-opt-no-rt-cxxmodules: /.../rootbench/root/math/mathcore/TMathBenchmarks.cxx:20:16: warning: variable ‘output_array’ set but not used [-Wunused-but-set-variable]
master-x86_64-centos7-gcc62-opt-no-rt-cxxmodules: /.../rootbench/root/math/mathcore/TMathBenchmarks.cxx:20:16: warning: variable ‘output_array’ set but not used [-Wunused-but-set-variable]
master-x86_64-centos7-gcc62-opt-no-rt-cxxmodules: /.../rootbench/root/math/mathcore/TMathBenchmarks.cxx:20:16: warning: variable ‘output_array’ set but not used [-Wunused-but-set-variable]
master-x86_64-centos7-gcc62-opt-no-rt-cxxmodules: /.../rootbench/root/math/mathcore/TMathBenchmarks.cxx:20:16: warning: variable ‘output_array’ set but not used [-Wunused-but-set-variable]
master-x86_64-centos7-gcc62-opt-no-rt-cxxmodules: /.../rootbench/root/math/mathcore/TMathBenchmarks.cxx:20:16: warning: variable ‘output_array’ set but not used [-Wunused-but-set-variable]
master-x86_64-centos7-gcc62-opt-no-rt-cxxmodules: /.../rootbench/root/math/mathcore/TMathBenchmarks.cxx:20:16: warning: variable ‘output_array’ set but not used [-Wunused-but-set-variable]
master-x86_64-centos7-gcc62-opt-no-rt-cxxmodules: /.../rootbench/root/math/mathcore/TMathBenchmarks.cxx:20:16: warning: variable ‘output_array’ set but not used [-Wunused-but-set-variable]
master-x86_64-centos7-gcc62-opt-no-rt-cxxmodules: /.../rootbench/root/math/mathcore/TMathBenchmarks.cxx:20:16: warning: variable ‘output_array’ set but not used [-Wunused-but-set-variable]
master-x86_64-centos7-gcc62-opt-no-rt-cxxmodules: /.../rootbench/root/math/mathcore/TMathBenchmarks.cxx:20:16: warning: variable ‘output_array’ set but not used [-Wunused-but-set-variable]
master-x86_64-centos7-gcc62-opt-no-rt-cxxmodules: /.../rootbench/root/math/mathcore/TMathBenchmarks.cxx:20:16: warning: variable ‘output_array’ set but not used [-Wunused-but-set-variable]
master-x86_64-centos7-gcc62-opt-no-rt-cxxmodules: /.../rootbench/root/math/mathcore/TMathBenchmarks.cxx:20:16: warning: variable ‘output_array’ set but not used [-Wunused-but-set-variable]
master-x86_64-centos7-gcc62-opt-no-rt-cxxmodules: /.../rootbench/root/math/mathcore/TMathBenchmarks.cxx:20:16: warning: variable ‘output_array’ set but not used [-Wunused-but-set-variable]
master-x86_64-centos7-gcc62-opt-no-rt-cxxmodules: /.../rootbench/root/math/mathcore/TMathBenchmarks.cxx:20:16: warning: variable ‘output_array’ set but not used [-Wunused-but-set-variable]
master-x86_64-centos7-gcc62-opt-no-rt-cxxmodules: /.../rootbench/root/math/mathcore/TMathBenchmarks.cxx:20:16: warning: variable ‘output_array’ set but not used [-Wunused-but-set-variable]
master-x86_64-centos7-gcc62-opt-no-rt-cxxmodules: /.../rootbench/root/math/mathcore/TMathBenchmarks.cxx:20:16: warning: variable ‘output_array’ set but not used [-Wunused-but-set-variable]
master-x86_64-centos7-gcc62-opt-no-rt-cxxmodules: /.../rootbench/root/math/mathcore/TMathBenchmarks.cxx:20:16: warning: variable ‘output_array’ set but not used [-Wunused-but-set-variable]
master-x86_64-centos7-gcc62-opt-no-rt-cxxmodules: /.../rootbench/root/math/mathcore/TMathBenchmarks.cxx:20:16: warning: variable ‘output_array’ set but not used [-Wunused-but-set-variable]
master-x86_64-centos7-gcc62-opt-no-rt-cxxmodules: /.../rootbench/root/math/mathcore/TMathBenchmarks.cxx:20:16: warning: variable ‘output_array’ set but not used [-Wunused-but-set-variable]
master-x86_64-centos7-gcc62-opt-master: /.../rootbench/root/math/mathcore/TMathBenchmarks.cxx:50:1: note: in expansion of macro ‘BENCHMARK_TMATH_FUNCTION’
master-x86_64-centos7-gcc62-opt-master: /.../rootbench/root/math/mathcore/TMathBenchmarks.cxx:50:1: note: in expansion of macro ‘BENCHMARK_TMATH_FUNCTION’
master-x86_64-centos7-gcc62-opt-no-rt-cxxmodules: /.../rootbench/root/math/mathcore/TMathBenchmarks.cxx:50:1: note: in expansion of macro ‘BENCHMARK_TMATH_FUNCTION’
master-x86_64-centos7-gcc62-opt-no-rt-cxxmodules: /.../rootbench/root/math/mathcore/TMathBenchmarks.cxx:50:1: note: in expansion of macro ‘BENCHMARK_TMATH_FUNCTION’
master-x86_64-centos7-gcc62-opt-master: /.../rootbench/root/math/mathcore/TMathBenchmarks.cxx:51:1: note: in expansion of macro ‘BENCHMARK_TMATH_FUNCTION’
master-x86_64-centos7-gcc62-opt-master: /.../rootbench/root/math/mathcore/TMathBenchmarks.cxx:51:1: note: in expansion of macro ‘BENCHMARK_TMATH_FUNCTION’
master-x86_64-centos7-gcc62-opt-no-rt-cxxmodules: /.../rootbench/root/math/mathcore/TMathBenchmarks.cxx:51:1: note: in expansion of macro ‘BENCHMARK_TMATH_FUNCTION’
master-x86_64-centos7-gcc62-opt-no-rt-cxxmodules: /.../rootbench/root/math/mathcore/TMathBenchmarks.cxx:51:1: note: in expansion of macro ‘BENCHMARK_TMATH_FUNCTION’
master-x86_64-centos7-gcc62-opt-master: /.../rootbench/root/math/mathcore/TMathBenchmarks.cxx:52:1: note: in expansion of macro ‘BENCHMARK_TMATH_FUNCTION’
master-x86_64-centos7-gcc62-opt-master: /.../rootbench/root/math/mathcore/TMathBenchmarks.cxx:52:1: note: in expansion of macro ‘BENCHMARK_TMATH_FUNCTION’
master-x86_64-centos7-gcc62-opt-no-rt-cxxmodules: /.../rootbench/root/math/mathcore/TMathBenchmarks.cxx:52:1: note: in expansion of macro ‘BENCHMARK_TMATH_FUNCTION’
master-x86_64-centos7-gcc62-opt-no-rt-cxxmodules: /.../rootbench/root/math/mathcore/TMathBenchmarks.cxx:52:1: note: in expansion of macro ‘BENCHMARK_TMATH_FUNCTION’
master-x86_64-centos7-gcc62-opt-master: /.../rootbench/root/math/mathcore/TMathBenchmarks.cxx:53:1: note: in expansion of macro ‘BENCHMARK_TMATH_FUNCTION’
master-x86_64-centos7-gcc62-opt-master: /.../rootbench/root/math/mathcore/TMathBenchmarks.cxx:53:1: note: in expansion of macro ‘BENCHMARK_TMATH_FUNCTION’
master-x86_64-centos7-gcc62-opt-no-rt-cxxmodules: /.../rootbench/root/math/mathcore/TMathBenchmarks.cxx:53:1: note: in expansion of macro ‘BENCHMARK_TMATH_FUNCTION’
master-x86_64-centos7-gcc62-opt-no-rt-cxxmodules: /.../rootbench/root/math/mathcore/TMathBenchmarks.cxx:53:1: note: in expansion of macro ‘BENCHMARK_TMATH_FUNCTION’
master-x86_64-centos7-gcc62-opt-master: /.../rootbench/root/math/mathcore/TMathBenchmarks.cxx:54:1: note: in expansion of macro ‘BENCHMARK_TMATH_FUNCTION’
master-x86_64-centos7-gcc62-opt-master: /.../rootbench/root/math/mathcore/TMathBenchmarks.cxx:54:1: note: in expansion of macro ‘BENCHMARK_TMATH_FUNCTION’
master-x86_64-centos7-gcc62-opt-no-rt-cxxmodules: /.../rootbench/root/math/mathcore/TMathBenchmarks.cxx:54:1: note: in expansion of macro ‘BENCHMARK_TMATH_FUNCTION’
master-x86_64-centos7-gcc62-opt-no-rt-cxxmodules: /.../rootbench/root/math/mathcore/TMathBenchmarks.cxx:54:1: note: in expansion of macro ‘BENCHMARK_TMATH_FUNCTION’
master-x86_64-centos7-gcc62-opt-master: /.../rootbench/root/math/mathcore/TMathBenchmarks.cxx:55:1: note: in expansion of macro ‘BENCHMARK_TMATH_FUNCTION’
master-x86_64-centos7-gcc62-opt-master: /.../rootbench/root/math/mathcore/TMathBenchmarks.cxx:55:1: note: in expansion of macro ‘BENCHMARK_TMATH_FUNCTION’
master-x86_64-centos7-gcc62-opt-no-rt-cxxmodules: /.../rootbench/root/math/mathcore/TMathBenchmarks.cxx:55:1: note: in expansion of macro ‘BENCHMARK_TMATH_FUNCTION’
master-x86_64-centos7-gcc62-opt-no-rt-cxxmodules: /.../rootbench/root/math/mathcore/TMathBenchmarks.cxx:55:1: note: in expansion of macro ‘BENCHMARK_TMATH_FUNCTION’
master-x86_64-centos7-gcc62-opt-master: /.../rootbench/root/math/mathcore/TMathBenchmarks.cxx:56:1: note: in expansion of macro ‘BENCHMARK_TMATH_FUNCTION’
master-x86_64-centos7-gcc62-opt-master: /.../rootbench/root/math/mathcore/TMathBenchmarks.cxx:56:1: note: in expansion of macro ‘BENCHMARK_TMATH_FUNCTION’
master-x86_64-centos7-gcc62-opt-no-rt-cxxmodules: /.../rootbench/root/math/mathcore/TMathBenchmarks.cxx:56:1: note: in expansion of macro ‘BENCHMARK_TMATH_FUNCTION’
master-x86_64-centos7-gcc62-opt-no-rt-cxxmodules: /.../rootbench/root/math/mathcore/TMathBenchmarks.cxx:56:1: note: in expansion of macro ‘BENCHMARK_TMATH_FUNCTION’
master-x86_64-centos7-gcc62-opt-master: /.../rootbench/root/math/mathcore/TMathBenchmarks.cxx:57:1: note: in expansion of macro ‘BENCHMARK_TMATH_FUNCTION’
master-x86_64-centos7-gcc62-opt-master: /.../rootbench/root/math/mathcore/TMathBenchmarks.cxx:57:1: note: in expansion of macro ‘BENCHMARK_TMATH_FUNCTION’
master-x86_64-centos7-gcc62-opt-no-rt-cxxmodules: /.../rootbench/root/math/mathcore/TMathBenchmarks.cxx:57:1: note: in expansion of macro ‘BENCHMARK_TMATH_FUNCTION’
master-x86_64-centos7-gcc62-opt-no-rt-cxxmodules: /.../rootbench/root/math/mathcore/TMathBenchmarks.cxx:57:1: note: in expansion of macro ‘BENCHMARK_TMATH_FUNCTION’
master-x86_64-centos7-gcc62-opt-master: /.../rootbench/root/math/mathcore/TMathBenchmarks.cxx:58:1: note: in expansion of macro ‘BENCHMARK_TMATH_FUNCTION’
master-x86_64-centos7-gcc62-opt-master: /.../rootbench/root/math/mathcore/TMathBenchmarks.cxx:58:1: note: in expansion of macro ‘BENCHMARK_TMATH_FUNCTION’
master-x86_64-centos7-gcc62-opt-no-rt-cxxmodules: /.../rootbench/root/math/mathcore/TMathBenchmarks.cxx:58:1: note: in expansion of macro ‘BENCHMARK_TMATH_FUNCTION’
master-x86_64-centos7-gcc62-opt-no-rt-cxxmodules: /.../rootbench/root/math/mathcore/TMathBenchmarks.cxx:58:1: note: in expansion of macro ‘BENCHMARK_TMATH_FUNCTION’
master-x86_64-centos7-gcc62-opt-master: /.../rootbench/root/math/mathcore/TMathBenchmarks.cxx:59:1: note: in expansion of macro ‘BENCHMARK_TMATH_FUNCTION’
master-x86_64-centos7-gcc62-opt-master: /.../rootbench/root/math/mathcore/TMathBenchmarks.cxx:59:1: note: in expansion of macro ‘BENCHMARK_TMATH_FUNCTION’
master-x86_64-centos7-gcc62-opt-no-rt-cxxmodules: /.../rootbench/root/math/mathcore/TMathBenchmarks.cxx:59:1: note: in expansion of macro ‘BENCHMARK_TMATH_FUNCTION’
master-x86_64-centos7-gcc62-opt-no-rt-cxxmodules: /.../rootbench/root/math/mathcore/TMathBenchmarks.cxx:59:1: note: in expansion of macro ‘BENCHMARK_TMATH_FUNCTION’